Сергей Сардаев

Добрый день!)

Никак не получается запустить тесты. Создал новый проект перейдя по ссылке git, установил Maven. Вот некоторые выводы из терминала и самой idea при запуске тестов.

idea

The default interactive shell is now zsh.
To update your account to use zsh, please run `chsh -s /bin/zsh`.
For more details, please visit https://support.apple.com/kb/HT208050.
MacBook-Pro-Sergej:collections-m0e4 sergejsardaev$ mvn clean instal
[INFO] Scanning for projects...
[WARNING] The project io.kovalevskyi.collections.test:m1e4:jar:1.0 uses prerequisites which is only intended for maven-plugin projects but not for non maven-plugin projects. For such purposes you should use the maven-enforcer-plugin. See https://maven.apache.org/enforcer/enforcer-rules/requireMavenVersion.html
[INFO] 
[INFO] ----------------< io.kovalevskyi.collections.test:m1e4 >----------------
[INFO] Building JMH benchmark sample: Java 1.0
[INFO] --------------------------------[ jar ]---------------------------------
[INFO] ------------------------------------------------------------------------
[INFO] BUILD FAILURE
[INFO] ------------------------------------------------------------------------
[INFO] Total time:  0.095 s
[INFO] Finished at: 2020-08-01T12:50:02+03:00
[INFO] ------------------------------------------------------------------------
[ERROR] Unknown lifecycle phase "instal". You must specify a valid lifecycle phase or a goal in the format <plugin-prefix>:<goal> or <plugin-group-id>:<plugin-artifact-id>[:<plugin-version>]:<goal>. Available lifecycle phases are: validate, initialize, generate-sources, process-sources, generate-resources, process-resources, compile, process-classes, generate-test-sources, process-test-sources, generate-test-resources, process-test-resources, test-compile, process-test-classes, test, prepare-package, package, pre-integration-test, integration-test, post-integration-test, verify, install, deploy, pre-clean, clean, post-clean, pre-site, site, post-site, site-deploy. -> [Help 1]
[ERROR] 
[ERROR] To see the full stack trace of the errors, re-run Maven with the -e switch.
[ERROR] Re-run Maven using the -X switch to enable full debug logging.
[ERROR] 
[ERROR] For more information about the errors and possible solutions, please read the following articles:
[ERROR] [Help 1] http://cwiki.apache.org/confluence/display/MAVEN/LifecyclePhaseNotFoundException

Maven версия

Apache Maven 3.6.3 (cecedd343002696d0abb50b32b541b8a6ba2883f)
Maven home: /Users/sergejsardaev/apache-maven-3.6.3
Java version: 13.0.2, vendor: Oracle Corporation, runtime: /Library/Java/JavaVirtualMachines/jdk-13.0.2.jdk/Contents/Home
Default locale: ru_RU, platform encoding: UTF-8
OS name: "mac os x", version: "10.15.5", arch: "x86_64", family: "mac"

java версия

java version "13.0.2" 2020-01-14
Java(TM) SE Runtime Environment (build 13.0.2+8)
Java HotSpot(TM) 64-Bit Server VM (build 13.0.2+8, mixed mode, sharing)

Подскажите пожалуйста на основе этих данных все ли у меня установлено? Если да, то пожалуйста подскажите в чем может быть проблема и варианты решения:)

1 0

Сергей Алексеенко

Здравствуйте.

С виду — все установлено верно.

Но проблема в опечатке в комманде. И MAVEN об этом прямо говорит:

[ERROR] Unknown lifecycle phase "instal". You must specify a valid lifecycle phase or a goal in the format <plugin-prefix>:<goal> or <plugin-group-id>:<plugin-artifact-id>[:<plugin-version>]:<goal>. Available lifecycle phases are: validate, initialize, generate-sources, process-sources, generate-resources, process-resources, compile, process-classes, generate-test-sources, process-test-sources, generate-test-resources, process-test-resources, test-compile, process-test-classes, test, prepare-package, package, pre-integration-test, integration-test, post-integration-test, verify, install, deploy, pre-clean, clean, post-clean, pre-site, site, post-site, site-deploy. -> [Help 1]

И действительно instal это уже не install. :)

0

Есть вопрос или хотите участвовать в обсуждении?

Зарегистрируйтесь или войдите в свой аккаунт

Нажимая кнопку «Зарегистрироваться», вы даёте своё согласие на обработку персональных данных в соответствии с «Политикой конфиденциальности» и соглашаетесь с «Условиями оказания услуг».

Похожие вопросы

Игорь Черкасов 28 мая 2020 →

Доброго времени суток! Никак не могу запустить тесты из первого задания в Idea. Maven - был установлен, ком...

Станислав Почековский 01 ноября 2018 →

Ментор, можно все таки по шагам расписать что нужно сделать чтобы провести эти тесты... Я создаю проект по ...

Artem Gorbounov 24 мая 2018 →

Если честно то не могу понять как добавить JMH в Eclipse. Maven не собирает проект потому что нет пакета с ...

Максим Обрубов 15 марта 2018 →

привет! запустил тесты, лучший score показал метод test1 Result "io.kovalevskyi.collections.test.TestClass....

Vladislav Dobrovolskiy 14 марта 2018 →

Под 9 java не собрался Annotation generator had thrown the exception. java.lang.NoClassDefFoundError: java...