Вопрос №55477 от пользователя Kirill Kozedub в проекте «Мессенджер «Hexlet Chat»»

Kirill Kozedub

Никита, добрый день!

Столкнулся с такой проблемой при установке Gulp SASS, выполнение npm install node-sass gulp-sass --save-dev на Ubunt 20.04 WSL с последним node приводит к ошибке:

832 verbose stack Error: command failed
832 verbose stack     at ChildProcess.<anonymous> (/home/qwaz/.nvm/versions/node/v16.3.0/lib/node_modules/npm/node_modules/@npmcli/promise-spawn/index.js:64:27)
832 verbose stack     at ChildProcess.emit (node:events:394:28)
832 verbose stack     at maybeClose (node:internal/child_process:1067:16)
832 verbose stack     at Process.ChildProcess._handle.onexit (node:internal/child_process:301:5)
833 verbose pkgid node-sass@4.14.1
834 verbose cwd /home/qwaz/dev/GitHub/beginner-gulp
835 verbose Linux 5.4.72-microsoft-standard-WSL2
836 verbose argv "/home/qwaz/.nvm/versions/node/v16.3.0/bin/node" "/home/qwaz/.nvm/versions/node/v16.3.0/bin/npm" "install" "gulp-sass" "--save-dev"
837 verbose node v16.3.0
838 verbose npm  v7.15.1
839 error code 1
840 error path /home/qwaz/dev/GitHub/beginner-gulp/node_modules/node-sass
841 error command failed
842 error command sh -c node scripts/build.js
843 error Building: /home/qwaz/.nvm/versions/node/v16.3.0/bin/node /home/qwaz/dev/GitHub/beginner-gulp/node_modules/node-gyp/bin/node-gyp.js rebuild --verbose --libsass_ext= --libsass_cflags= --libsass_ldflags= --libsass_library=
843 error make: Entering directory '/home/qwaz/dev/GitHub/beginner-gulp/node_modules/node-sass/build'
843 error   g++ '-DNODE_GYP_MODULE_NAME=libsass' '-DUSING_UV_SHARED=1' '-DUSING_V8_SHARED=1' '-DV8_DEPRECATION_WARNINGS=1' '-DV8_DEPRECATION_WARNINGS' '-DV8_IMMINENT_DEPRECATION_WARNINGS' '-D_GLIBCXX_USE_CXX11_ABI=1' '-D_LARGEFILE_SOURCE' '-D_FILE_OFFSET_BITS=64' '-D__STDC_FORMAT_MACROS' '-DOPENSSL_NO_PINSHARED' '-DOPENSSL_THREADS' '-DLIBSASS_VERSION="3.5.5"' -I/home/qwaz/.node-gyp/16.3.0/include/node -I/home/qwaz/.node-gyp/16.3.0/src -I/home/qwaz/.node-gyp/16.3.0/deps/openssl/config -I/home/qwaz/.node-gyp/16.3.0/deps/openssl/openssl/include -I/home/qwaz/.node-gyp/16.3.0/deps/uv/include -I/home/qwaz/.node-gyp/16.3.0/deps/zlib -I/home/qwaz/.node-gyp/16.3.0/deps/v8/include -I../src/libsass/include  -fPIC -pthread -Wall -Wextra -Wno-unused-parameter -m64 -O3 -fno-omit-frame-pointer -std=gnu++14 -std=c++0x -fexceptions -frtti -MMD -MF ./Release/.deps/Release/obj.target/libsass/src/libsass/src/ast.o.d.raw   -c -o Release/obj.target/libsass/src/libsass/src/ast.o ../src/libsass/src/ast.cpp
843 error   g++ '-DNODE_GYP_MODULE_NAME=libsass' '-DUSING_UV_SHARED=1' '-DUSING_V8_SHARED=1' '-DV8_DEPRECATION_WARNINGS=1' '-DV8_DEPRECATION_WARNINGS' '-DV8_IMMINENT_DEPRECATION_WARNINGS' '-D_GLIBCXX_USE_CXX11_ABI=1' '-D_LARGEFILE_SOURCE' '-D_FILE_OFFSET_BITS=64' '-D__STDC_FORMAT_MACROS' '-DOPENSSL_NO_PINSHARED' '-DOPENSSL_THREADS' '-DLIBSASS_VERSION="3.5.5"' -I/home/qwaz/.node-gyp/16.3.0/include/node -I/home/qwaz/.node-gyp/16.3.0/src -I/home/qwaz/.node-gyp/16.3.0/deps/openssl/config -I/home/qwaz/.node-gyp/16.3.0/deps/openssl/openssl/include -I/home/qwaz/.node-gyp/16.3.0/deps/uv/include -I/home/qwaz/.node-gyp/16.3.0/deps/zlib -I/home/qwaz/.node-gyp/16.3.0/deps/v8/include -I../src/libsass/include  -fPIC -pthread -Wall -Wextra -Wno-unused-parameter -m64 -O3 -fno-omit-frame-pointer -std=gnu++14 -std=c++0x -fexceptions -frtti -MMD -MF ./Release/.deps/Release/obj.target/libsass/src/libsass/src/ast_fwd_decl.o.d.raw   -c -o Release/obj.target/libsass/src/libsass/src/ast_fwd_decl.o ../src/libsass/src/ast_fwd_decl.cpp
843 error   g++ '-DNODE_GYP_MODULE_NAME=libsass' '-DUSING_UV_SHARED=1' '-DUSING_V8_SHARED=1' '-DV8_DEPRECATION_WARNINGS=1' '-DV8_DEPRECATION_WARNINGS' '-DV8_IMMINENT_DEPRECATION_WARNINGS' '-D_GLIBCXX_USE_CXX11_ABI=1' '-D_LARGEFILE_SOURCE' '-D_FILE_OFFSET_BITS=64' '-D__STDC_FORMAT_MACROS' '-DOPENSSL_NO_PINSHARED' '-DOPENSSL_THREADS' '-DLIBSASS_VERSION="3.5.5"' -I/home/qwaz/.node-gyp/16.3.0/include/node -I/home/qwaz/.node-gyp/16.3.0/src -I/home/qwaz/.node-gyp/16.3.0/deps/openssl/config -I/home/qwaz/.node-gyp/16.3.0/deps/openssl/openssl/include -I/home/qwaz/.node-gyp/16.3.0/deps/uv/include -I/home/qwaz/.node-gyp/16.3.0/deps/zlib -I/home/qwaz/.node-gyp/16.3.0/deps/v8/include -I../src/libsass/include  -fPIC -pthread -Wall -Wextra -Wno-unused-parameter -m64 -O3 -fno-omit-frame-pointer -std=gnu++14 -std=c++0x -fexceptions -frtti -MMD -MF ./Release/.deps/Release/obj.target/libsass/src/libsass/src/backtrace.o.d.raw   -c -o Release/obj.target/libsass/src/libsass/src/backtrace.o ../src/libsass/src/backtrace.cpp
843 error   g++ '-DNODE_GYP_MODULE_NAME=libsass' '-DUSING_UV_SHARED=1' '-DUSING_V8_SHARED=1' '-DV8_DEPRECATION_WARNINGS=1' '-DV8_DEPRECATION_WARNINGS' '-DV8_IMMINENT_DEPRECATION_WARNINGS' '-D_GLIBCXX_USE_CXX11_ABI=1' '-D_LARGEFILE_SOURCE' '-D_FILE_OFFSET_BITS=64' '-D__STDC_FORMAT_MACROS' '-DOPENSSL_NO_PINSHARED' '-DOPENSSL_THREADS' '-DLIBSASS_VERSION="3.5.5"' -I/home/qwaz/.node-gyp/16.3.0/include/node -I/home/qwaz/.node-gyp/16.3.0/src -I/home/qwaz/.node-gyp/16.3.0/deps/openssl/config -I/home/qwaz/.node-gyp/16.3.0/deps/openssl/openssl/include -I/home/qwaz/.node-gyp/16.3.0/deps/uv/include -I/home/qwaz/.node-gyp/16.3.0/deps/zlib -I/home/qwaz/.node-gyp/16.3.0/deps/v8/include -I../src/libsass/include  -fPIC -pthread -Wall -Wextra -Wno-unused-parameter -m64 -O3 -fno-omit-frame-pointer -std=gnu++14 -std=c++0x -fexceptions -frtti -MMD -MF ./Release/.deps/Release/obj.target/libsass/src/libsass/src/base64vlq.o.d.raw   -c -o Release/obj.target/libsass/src/libsass/src/base64vlq.o ../src/libsass/src/base64vlq.cpp
843 error   g++ '-DNODE_GYP_MODULE_NAME=libsass' '-DUSING_UV_SHARED=1' '-DUSING_V8_SHARED=1' '-DV8_DEPRECATION_WARNINGS=1' '-DV8_DEPRECATION_WARNINGS' '-DV8_IMMINENT_DEPRECATION_WARNINGS' '-D_GLIBCXX_USE_CXX11_ABI=1' '-D_LARGEFILE_SOURCE' '-D_FILE_OFFSET_BITS=64' '-D__STDC_FORMAT_MACROS' '-DOPENSSL_NO_PINSHARED' '-DOPENSSL_THREADS' '-DLIBSASS_VERSION="3.5.5"' -I/home/qwaz/.node-gyp/16.3.0/include/node -I/home/qwaz/.node-gyp/16.3.0/src -I/home/qwaz/.node-gyp/16.3.0/deps/openssl/config -I/home/qwaz/.node-gyp/16.3.0/deps/openssl/openssl/include -I/home/qwaz/.node-gyp/16.3.0/deps/uv/include -I/home/qwaz/.node-gyp/16.3.0/deps/zlib -I/home/qwaz/.node-gyp/16.3.0/deps/v8/include -I../src/libsass/include  -fPIC -pthread -Wall -Wextra -Wno-unused-parameter -m64 -O3 -fno-omit-frame-pointer -std=gnu++14 -std=c++0x -fexceptions -frtti -MMD -MF ./Release/.deps/Release/obj.target/libsass/src/libsass/src/bind.o.d.raw   -c -o Release/obj.target/libsass/src/libsass/src/bind.o ../src/libsass/src/bind.cpp
843 error   cc '-DNODE_GYP_MODULE_NAME=libsass' '-DUSING_UV_SHARED=1' '-DUSING_V8_SHARED=1' '-DV8_DEPRECATION_WARNINGS=1' '-DV8_DEPRECATION_WARNINGS' '-DV8_IMMINENT_DEPRECATION_WARNINGS' '-D_GLIBCXX_USE_CXX11_ABI=1' '-D_LARGEFILE_SOURCE' '-D_FILE_OFFSET_BITS=64' '-D__STDC_FORMAT_MACROS' '-DOPENSSL_NO_PINSHARED' '-DOPENSSL_THREADS' '-DLIBSASS_VERSION="3.5.5"' -I/home/qwaz/.node-gyp/16.3.0/include/node -I/home/qwaz/.node-gyp/16.3.0/src -I/home/qwaz/.node-gyp/16.3.0/deps/openssl/config -I/home/qwaz/.node-gyp/16.3.0/deps/openssl/openssl/include -I/home/qwaz/.node-gyp/16.3.0/deps/uv/include -I/home/qwaz/.node-gyp/16.3.0/deps/zlib -I/home/qwaz/.node-gyp/16.3.0/deps/v8/include -I../src/libsass/include  -fPIC -pthread -Wall -Wextra -Wno-unused-parameter -m64 -O3 -fno-omit-frame-pointer  -MMD -MF ./Release/.deps/Release/obj.target/libsass/src/libsass/src/cencode.o.d.raw   -c -o Release/obj.target/libsass/src/libsass/src/cencode.o ../src/libsass/src/cencode.c
843 error   g++ '-DNODE_GYP_MODULE_NAME=libsass' '-DUSING_UV_SHARED=1' '-DUSING_V8_SHARED=1' '-DV8_DEPRECATION_WARNINGS=1' '-DV8_DEPRECATION_WARNINGS' '-DV8_IMMINENT_DEPRECATION_WARNINGS' '-D_GLIBCXX_USE_CXX11_ABI=1' '-D_LARGEFILE_SOURCE' '-D_FILE_OFFSET_BITS=64' '-D__STDC_FORMAT_MACROS' '-DOPENSSL_NO_PINSHARED' '-DOPENSSL_THREADS' '-DLIBSASS_VERSION="3.5.5"' -I/home/qwaz/.node-gyp/16.3.0/include/node -I/home/qwaz/.node-gyp/16.3.0/src -I/home/qwaz/.node-gyp/16.3.0/deps/openssl/config -I/home/qwaz/.node-gyp/16.3.0/deps/openssl/openssl/include -I/home/qwaz/.node-gyp/16.3.0/deps/uv/include -I/home/qwaz/.node-gyp/16.3.0/deps/zlib -I/home/qwaz/.node-gyp/16.3.0/deps/v8/include -I../src/libsass/include  -fPIC -pthread -Wall -Wextra -Wno-unused-parameter -m64 -O3 -fno-omit-frame-pointer -std=gnu++14 -std=c++0x -fexceptions -frtti -MMD -MF ./Release/.deps/Release/obj.target/libsass/src/libsass/src/check_nesting.o.d.raw   -c -o Release/obj.target/libsass/src/libsass/src/check_nesting.o ../src/libsass/src/check_nesting.cpp
843 error   g++ '-DNODE_GYP_MODULE_NAME=libsass' '-DUSING_UV_SHARED=1' '-DUSING_V8_SHARED=1' '-DV8_DEPRECATION_WARNINGS=1' '-DV8_DEPRECATION_WARNINGS' '-DV8_IMMINENT_DEPRECATION_WARNINGS' '-D_GLIBCXX_USE_CXX11_ABI=1' '-D_LARGEFILE_SOURCE' '-D_FILE_OFFSET_BITS=64' '-D__STDC_FORMAT_MACROS' '-DOPENSSL_NO_PINSHARED' '-DOPENSSL_THREADS' '-DLIBSASS_VERSION="3.5.5"' -I/home/qwaz/.node-gyp/16.3.0/include/node -I/home/qwaz/.node-gyp/16.3.0/src -I/home/qwaz/.node-gyp/16.3.0/deps/openssl/config -I/home/qwaz/.node-gyp/16.3.0/deps/openssl/openssl/include -I/home/qwaz/.node-gyp/16.3.0/deps/uv/include -I/home/qwaz/.node-gyp/16.3.0/deps/zlib -I/home/qwaz/.node-gyp/16.3.0/deps/v8/include -I../src/libsass/include  -fPIC -pthread -Wall -Wextra -Wno-unused-parameter -m64 -O3 -fno-omit-frame-pointer -std=gnu++14 -std=c++0x -fexceptions -frtti -MMD -MF ./Release/.deps/Release/obj.target/libsass/src/libsass/src/color_maps.o.d.raw   -c -o Release/obj.target/libsass/src/libsass/src/color_maps.o ../src/libsass/src/color_maps.cpp
843 error   g++ '-DNODE_GYP_MODULE_NAME=libsass' '-DUSING_UV_SHARED=1' '-DUSING_V8_SHARED=1' '-DV8_DEPRECATION_WARNINGS=1' '-DV8_DEPRECATION_WARNINGS' '-DV8_IMMINENT_DEPRECATION_WARNINGS' '-D_GLIBCXX_USE_CXX11_ABI=1' '-D_LARGEFILE_SOURCE' '-D_FILE_OFFSET_BITS=64' '-D__STDC_FORMAT_MACROS' '-DOPENSSL_NO_PINSHARED' '-DOPENSSL_THREADS' '-DLIBSASS_VERSION="3.5.5"' -I/home/qwaz/.node-gyp/16.3.0/include/node -I/home/qwaz/.node-gyp/16.3.0/src -I/home/qwaz/.node-gyp/16.3.0/deps/openssl/config -I/home/qwaz/.node-gyp/16.3.0/deps/openssl/openssl/include -I/home/qwaz/.node-gyp/16.3.0/deps/uv/include -I/home/qwaz/.node-gyp/16.3.0/deps/zlib -I/home/qwaz/.node-gyp/16.3.0/deps/v8/include -I../src/libsass/include  -fPIC -pthread -Wall -Wextra -Wno-unused-parameter -m64 -O3 -fno-omit-frame-pointer -std=gnu++14 -std=c++0x -fexceptions -frtti -MMD -MF ./Release/.deps/Release/obj.target/libsass/src/libsass/src/constants.o.d.raw   -c -o Release/obj.target/libsass/src/libsass/src/constants.o ../src/libsass/src/constants.cpp
843 error   g++ '-DNODE_GYP_MODULE_NAME=libsass' '-DUSING_UV_SHARED=1' '-DUSING_V8_SHARED=1' '-DV8_DEPRECATION_WARNINGS=1' '-DV8_DEPRECATION_WARNINGS' '-DV8_IMMINENT_DEPRECATION_WARNINGS' '-D_GLIBCXX_USE_CXX11_ABI=1' '-D_LARGEFILE_SOURCE' '-D_FILE_OFFSET_BITS=64' '-D__STDC_FORMAT_MACROS' '-DOPENSSL_NO_PINSHARED' '-DOPENSSL_THREADS' '-DLIBSASS_VERSION="3.5.5"' -I/home/qwaz/.node-gyp/16.3.0/include/node -I/home/qwaz/.node-gyp/16.3.0/src -I/home/qwaz/.node-gyp/16.3.0/deps/openssl/config -I/home/qwaz/.node-gyp/16.3.0/deps/openssl/openssl/include -I/home/qwaz/.node-gyp/16.3.0/deps/uv/include -I/home/qwaz/.node-gyp/16.3.0/deps/zlib -I/home/qwaz/.node-gyp/16.3.0/deps/v8/include -I../src/libsass/include  -fPIC -pthread -Wall -Wextra -Wno-unused-parameter -m64 -O3 -fno-omit-frame-pointer -std=gnu++14 -std=c++0x -fexceptions -frtti -MMD -MF ./Release/.deps/Release/obj.target/libsass/src/libsass/src/context.o.d.raw   -c -o Release/obj.target/libsass/src/libsass/src/context.o ../src/libsass/src/context.cpp
843 error   g++ '-DNODE_GYP_MODULE_NAME=libsass' '-DUSING_UV_SHARED=1' '-DUSING_V8_SHARED=1' '-DV8_DEPRECATION_WARNINGS=1' '-DV8_DEPRECATION_WARNINGS' '-DV8_IMMINENT_DEPRECATION_WARNINGS' '-D_GLIBCXX_USE_CXX11_ABI=1' '-D_LARGEFILE_SOURCE' '-D_FILE_OFFSET_BITS=64' '-D__STDC_FORMAT_MACROS' '-DOPENSSL_NO_PINSHARED' '-DOPENSSL_THREADS' '-DLIBSASS_VERSION="3.5.5"' -I/home/qwaz/.node-gyp/16.3.0/include/node -I/home/qwaz/.node-gyp/16.3.0/src -I/home/qwaz/.node-gyp/16.3.0/deps/openssl/config -I/home/qwaz/.node-gyp/16.3.0/deps/openssl/openssl/include -I/home/qwaz/.node-gyp/16.3.0/deps/uv/include -I/home/qwaz/.node-gyp/16.3.0/deps/zlib -I/home/qwaz/.node-gyp/16.3.0/deps/v8/include -I../src/libsass/include  -fPIC -pthread -Wall -Wextra -Wno-unused-parameter -m64 -O3 -fno-omit-frame-pointer -std=gnu++14 -std=c++0x -fexceptions -frtti -MMD -MF ./Release/.deps/Release/obj.target/libsass/src/libsass/src/cssize.o.d.raw   -c -o Release/obj.target/libsass/src/libsass/src/cssize.o ../src/libsass/src/cssize.cpp
843 error   g++ '-DNODE_GYP_MODULE_NAME=libsass' '-DUSING_UV_SHARED=1' '-DUSING_V8_SHARED=1' '-DV8_DEPRECATION_WARNINGS=1' '-DV8_DEPRECATION_WARNINGS' '-DV8_IMMINENT_DEPRECATION_WARNINGS' '-D_GLIBCXX_USE_CXX11_ABI=1' '-D_LARGEFILE_SOURCE' '-D_FILE_OFFSET_BITS=64' '-D__STDC_FORMAT_MACROS' '-DOPENSSL_NO_PINSHARED' '-DOPENSSL_THREADS' '-DLIBSASS_VERSION="3.5.5"' -I/home/qwaz/.node-gyp/16.3.0/include/node -I/home/qwaz/.node-gyp/16.3.0/src -I/home/qwaz/.node-gyp/16.3.0/deps/openssl/config -I/home/qwaz/.node-gyp/16.3.0/deps/openssl/openssl/include -I/home/qwaz/.node-gyp/16.3.0/deps/uv/include -I/home/qwaz/.node-gyp/16.3.0/deps/zlib -I/home/qwaz/.node-gyp/16.3.0/deps/v8/include -I../src/libsass/include  -fPIC -pthread -Wall -Wextra -Wno-unused-parameter -m64 -O3 -fno-omit-frame-pointer -std=gnu++14 -std=c++0x -fexceptions -frtti -MMD -MF ./Release/.deps/Release/obj.target/libsass/src/libsass/src/emitter.o.d.raw   -c -o Release/obj.target/libsass/src/libsass/src/emitter.o ../src/libsass/src/emitter.cpp
843 error   g++ '-DNODE_GYP_MODULE_NAME=libsass' '-DUSING_UV_SHARED=1' '-DUSING_V8_SHARED=1' '-DV8_DEPRECATION_WARNINGS=1' '-DV8_DEPRECATION_WARNINGS' '-DV8_IMMINENT_DEPRECATION_WARNINGS' '-D_GLIBCXX_USE_CXX11_ABI=1' '-D_LARGEFILE_SOURCE' '-D_FILE_OFFSET_BITS=64' '-D__STDC_FORMAT_MACROS' '-DOPENSSL_NO_PINSHARED' '-DOPENSSL_THREADS' '-DLIBSASS_VERSION="3.5.5"' -I/home/qwaz/.node-gyp/16.3.0/include/node -I/home/qwaz/.node-gyp/16.3.0/src -I/home/qwaz/.node-gyp/16.3.0/deps/openssl/config -I/home/qwaz/.node-gyp/16.3.0/deps/openssl/openssl/include -I/home/qwaz/.node-gyp/16.3.0/deps/uv/include -I/home/qwaz/.node-gyp/16.3.0/deps/zlib -I/home/qwaz/.node-gyp/16.3.0/deps/v8/include -I../src/libsass/include  -fPIC -pthread -Wall -Wextra -Wno-unused-parameter -m64 -O3 -fno-omit-frame-pointer -std=gnu++14 -std=c++0x -fexceptions -frtti -MMD -MF ./Release/.deps/Release/obj.target/libsass/src/libsass/src/environment.o.d.raw   -c -o Release/obj.target/libsass/src/libsass/src/environment.o ../src/libsass/src/environment.cpp
843 error   g++ '-DNODE_GYP_MODULE_NAME=libsass' '-DUSING_UV_SHARED=1' '-DUSING_V8_SHARED=1' '-DV8_DEPRECATION_WARNINGS=1' '-DV8_DEPRECATION_WARNINGS' '-DV8_IMMINENT_DEPRECATION_WARNINGS' '-D_GLIBCXX_USE_CXX11_ABI=1' '-D_LARGEFILE_SOURCE' '-D_FILE_OFFSET_BITS=64' '-D__STDC_FORMAT_MACROS' '-DOPENSSL_NO_PINSHARED' '-DOPENSSL_THREADS' '-DLIBSASS_VERSION="3.5.5"' -I/home/qwaz/.node-gyp/16.3.0/include/node -I/home/qwaz/.node-gyp/16.3.0/src -I/home/qwaz/.node-gyp/16.3.0/deps/openssl/config -I/home/qwaz/.node-gyp/16.3.0/deps/openssl/openssl/include -I/home/qwaz/.node-gyp/16.3.0/deps/uv/include -I/home/qwaz/.node-gyp/16.3.0/deps/zlib -I/home/qwaz/.node-gyp/16.3.0/deps/v8/include -I../src/libsass/include  -fPIC -pthread -Wall -Wextra -Wno-unused-parameter -m64 -O3 -fno-omit-frame-pointer -std=gnu++14 -std=c++0x -fexceptions -frtti -MMD -MF ./Release/.deps/Release/obj.target/libsass/src/libsass/src/error_handling.o.d.raw   -c -o Release/obj.target/libsass/src/libsass/src/error_handling.o ../src/libsass/src/error_handling.cpp
843 error   g++ '-DNODE_GYP_MODULE_NAME=libsass' '-DUSING_UV_SHARED=1' '-DUSING_V8_SHARED=1' '-DV8_DEPRECATION_WARNINGS=1' '-DV8_DEPRECATION_WARNINGS' '-DV8_IMMINENT_DEPRECATION_WARNINGS' '-D_GLIBCXX_USE_CXX11_ABI=1' '-D_LARGEFILE_SOURCE' '-D_FILE_OFFSET_BITS=64' '-D__STDC_FORMAT_MACROS' '-DOPENSSL_NO_PINSHARED' '-DOPENSSL_THREADS' '-DLIBSASS_VERSION="3.5.5"' -I/home/qwaz/.node-gyp/16.3.0/include/node -I/home/qwaz/.node-gyp/16.3.0/src -I/home/qwaz/.node-gyp/16.3.0/deps/openssl/config -I/home/qwaz/.node-gyp/16.3.0/deps/openssl/openssl/include -I/home/qwaz/.node-gyp/16.3.0/deps/uv/include -I/home/qwaz/.node-gyp/16.3.0/deps/zlib -I/home/qwaz/.node-gyp/16.3.0/deps/v8/include -I../src/libsass/include  -fPIC -pthread -Wall -Wextra -Wno-unused-parameter -m64 -O3 -fno-omit-frame-pointer -std=gnu++14 -std=c++0x -fexceptions -frtti -MMD -MF ./Release/.deps/Release/obj.target/libsass/src/libsass/src/eval.o.d.raw   -c -o Release/obj.target/libsass/src/libsass/src/eval.o ../src/libsass/src/eval.cpp
843 error   g++ '-DNODE_GYP_MODULE_NAME=libsass' '-DUSING_UV_SHARED=1' '-DUSING_V8_SHARED=1' '-DV8_DEPRECATION_WARNINGS=1' '-DV8_DEPRECATION_WARNINGS' '-DV8_IMMINENT_DEPRECATION_WARNINGS' '-D_GLIBCXX_USE_CXX11_ABI=1' '-D_LARGEFILE_SOURCE' '-D_FILE_OFFSET_BITS=64' '-D__STDC_FORMAT_MACROS' '-DOPENSSL_NO_PINSHARED' '-DOPENSSL_THREADS' '-DLIBSASS_VERSION="3.5.5"' -I/home/qwaz/.node-gyp/16.3.0/include/node -I/home/qwaz/.node-gyp/16.3.0/src -I/home/qwaz/.node-gyp/16.3.0/deps/openssl/config -I/home/qwaz/.node-gyp/16.3.0/deps/openssl/openssl/include -I/home/qwaz/.node-gyp/16.3.0/deps/uv/include -I/home/qwaz/.node-gyp/16.3.0/deps/zlib -I/home/qwaz/.node-gyp/16.3.0/deps/v8/include -I../src/libsass/include  -fPIC -pthread -Wall -Wextra -Wno-unused-parameter -m64 -O3 -fno-omit-frame-pointer -std=gnu++14 -std=c++0x -fexceptions -frtti -MMD -MF ./Release/.deps/Release/obj.target/libsass/src/libsass/src/expand.o.d.raw   -c -o Release/obj.target/libsass/src/libsass/src/expand.o ../src/libsass/src/expand.cpp
843 error   g++ '-DNODE_GYP_MODULE_NAME=libsass' '-DUSING_UV_SHARED=1' '-DUSING_V8_SHARED=1' '-DV8_DEPRECATION_WARNINGS=1' '-DV8_DEPRECATION_WARNINGS' '-DV8_IMMINENT_DEPRECATION_WARNINGS' '-D_GLIBCXX_USE_CXX11_ABI=1' '-D_LARGEFILE_SOURCE' '-D_FILE_OFFSET_BITS=64' '-D__STDC_FORMAT_MACROS' '-DOPENSSL_NO_PINSHARED' '-DOPENSSL_THREADS' '-DLIBSASS_VERSION="3.5.5"' -I/home/qwaz/.node-gyp/16.3.0/include/node -I/home/qwaz/.node-gyp/16.3.0/src -I/home/qwaz/.node-gyp/16.3.0/deps/openssl/config -I/home/qwaz/.node-gyp/16.3.0/deps/openssl/openssl/include -I/home/qwaz/.node-gyp/16.3.0/deps/uv/include -I/home/qwaz/.node-gyp/16.3.0/deps/zlib -I/home/qwaz/.node-gyp/16.3.0/deps/v8/include -I../src/libsass/include  -fPIC -pthread -Wall -Wextra -Wno-unused-parameter -m64 -O3 -fno-omit-frame-pointer -std=gnu++14 -std=c++0x -fexceptions -frtti -MMD -MF ./Release/.deps/Release/obj.target/libsass/src/libsass/src/extend.o.d.raw   -c -o Release/obj.target/libsass/src/libsass/src/extend.o ../src/libsass/src/extend.cpp
843 error   g++ '-DNODE_GYP_MODULE_NAME=libsass' '-DUSING_UV_SHARED=1' '-DUSING_V8_SHARED=1' '-DV8_DEPRECATION_WARNINGS=1' '-DV8_DEPRECATION_WARNINGS' '-DV8_IMMINENT_DEPRECATION_WARNINGS' '-D_GLIBCXX_USE_CXX11_ABI=1' '-D_LARGEFILE_SOURCE' '-D_FILE_OFFSET_BITS=64' '-D__STDC_FORMAT_MACROS' '-DOPENSSL_NO_PINSHARED' '-DOPENSSL_THREADS' '-DLIBSASS_VERSION="3.5.5"' -I/home/qwaz/.node-gyp/16.3.0/include/node -I/home/qwaz/.node-gyp/16.3.0/src -I/home/qwaz/.node-gyp/16.3.0/deps/openssl/config -I/home/qwaz/.node-gyp/16.3.0/deps/openssl/openssl/include -I/home/qwaz/.node-gyp/16.3.0/deps/uv/include -I/home/qwaz/.node-gyp/16.3.0/deps/zlib -I/home/qwaz/.node-gyp/16.3.0/deps/v8/include -I../src/libsass/include  -fPIC -pthread -Wall -Wextra -Wno-unused-parameter -m64 -O3 -fno-omit-frame-pointer -std=gnu++14 -std=c++0x -fexceptions -frtti -MMD -MF ./Release/.deps/Release/obj.target/libsass/src/libsass/src/file.o.d.raw   -c -o Release/obj.target/libsass/src/libsass/src/file.o ../src/libsass/src/file.cpp
843 error   g++ '-DNODE_GYP_MODULE_NAME=libsass' '-DUSING_UV_SHARED=1' '-DUSING_V8_SHARED=1' '-DV8_DEPRECATION_WARNINGS=1' '-DV8_DEPRECATION_WARNINGS' '-DV8_IMMINENT_DEPRECATION_WARNINGS' '-D_GLIBCXX_USE_CXX11_ABI=1' '-D_LARGEFILE_SOURCE' '-D_FILE_OFFSET_BITS=64' '-D__STDC_FORMAT_MACROS' '-DOPENSSL_NO_PINSHARED' '-DOPENSSL_THREADS' '-DLIBSASS_VERSION="3.5.5"' -I/home/qwaz/.node-gyp/16.3.0/include/node -I/home/qwaz/.node-gyp/16.3.0/src -I/home/qwaz/.node-gyp/16.3.0/deps/openssl/config -I/home/qwaz/.node-gyp/16.3.0/deps/openssl/openssl/include -I/home/qwaz/.node-gyp/16.3.0/deps/uv/include -I/home/qwaz/.node-gyp/16.3.0/deps/zlib -I/home/qwaz/.node-gyp/16.3.0/deps/v8/include -I../src/libsass/include  -fPIC -pthread -Wall -Wextra -Wno-unused-parameter -m64 -O3 -fno-omit-frame-pointer -std=gnu++14 -std=c++0x -fexceptions -frtti -MMD -MF ./Release/.deps/Release/obj.target/libsass/src/libsass/src/functions.o.d.raw   -c -o Release/obj.target/libsass/src/libsass/src/functions.o ../src/libsass/src/functions.cpp
843 error   g++ '-DNODE_GYP_MODULE_NAME=libsass' '-DUSING_UV_SHARED=1' '-DUSING_V8_SHARED=1' '-DV8_DEPRECATION_WARNINGS=1' '-DV8_DEPRECATION_WARNINGS' '-DV8_IMMINENT_DEPRECATION_WARNINGS' '-D_GLIBCXX_USE_CXX11_ABI=1' '-D_LARGEFILE_SOURCE' '-D_FILE_OFFSET_BITS=64' '-D__STDC_FORMAT_MACROS' '-DOPENSSL_NO_PINSHARED' '-DOPENSSL_THREADS' '-DLIBSASS_VERSION="3.5.5"' -I/home/qwaz/.node-gyp/16.3.0/include/node -I/home/qwaz/.node-gyp/16.3.0/src -I/home/qwaz/.node-gyp/16.3.0/deps/openssl/config -I/home/qwaz/.node-gyp/16.3.0/deps/openssl/openssl/include -I/home/qwaz/.node-gyp/16.3.0/deps/uv/include -I/home/qwaz/.node-gyp/16.3.0/deps/zlib -I/home/qwaz/.node-gyp/16.3.0/deps/v8/include -I../src/libsass/include  -fPIC -pthread -Wall -Wextra -Wno-unused-parameter -m64 -O3 -fno-omit-frame-pointer -std=gnu++14 -std=c++0x -fexceptions -frtti -MMD -MF ./Release/.deps/Release/obj.target/libsass/src/libsass/src/inspect.o.d.raw   -c -o Release/obj.target/libsass/src/libsass/src/inspect.o ../src/libsass/src/inspect.cpp
843 error   g++ '-DNODE_GYP_MODULE_NAME=libsass' '-DUSING_UV_SHARED=1' '-DUSING_V8_SHARED=1' '-DV8_DEPRECATION_WARNINGS=1' '-DV8_DEPRECATION_WARNINGS' '-DV8_IMMINENT_DEPRECATION_WARNINGS' '-D_GLIBCXX_USE_CXX11_ABI=1' '-D_LARGEFILE_SOURCE' '-D_FILE_OFFSET_BITS=64' '-D__STDC_FORMAT_MACROS' '-DOPENSSL_NO_PINSHARED' '-DOPENSSL_THREADS' '-DLIBSASS_VERSION="3.5.5"' -I/home/qwaz/.node-gyp/16.3.0/include/node -I/home/qwaz/.node-gyp/16.3.0/src -I/home/qwaz/.node-gyp/16.3.0/deps/openssl/config -I/home/qwaz/.node-gyp/16.3.0/deps/openssl/openssl/include -I/home/qwaz/.node-gyp/16.3.0/deps/uv/include -I/home/qwaz/.node-gyp/16.3.0/deps/zlib -I/home/qwaz/.node-gyp/16.3.0/deps/v8/include -I../src/libsass/include  -fPIC -pthread -Wall -Wextra -Wno-unused-parameter -m64 -O3 -fno-omit-frame-pointer -std=gnu++14 -std=c++0x -fexceptions -frtti -MMD -MF ./Release/.deps/Release/obj.target/libsass/src/libsass/src/json.o.d.raw   -c -o Release/obj.target/libsass/src/libsass/src/json.o ../src/libsass/src/json.cpp
843 error   g++ '-DNODE_GYP_MODULE_NAME=libsass' '-DUSING_UV_SHARED=1' '-DUSING_V8_SHARED=1' '-DV8_DEPRECATION_WARNINGS=1' '-DV8_DEPRECATION_WARNINGS' '-DV8_IMMINENT_DEPRECATION_WARNINGS' '-D_GLIBCXX_USE_CXX11_ABI=1' '-D_LARGEFILE_SOURCE' '-D_FILE_OFFSET_BITS=64' '-D__STDC_FORMAT_MACROS' '-DOPENSSL_NO_PINSHARED' '-DOPENSSL_THREADS' '-DLIBSASS_VERSION="3.5.5"' -I/home/qwaz/.node-gyp/16.3.0/include/node -I/home/qwaz/.node-gyp/16.3.0/src -I/home/qwaz/.node-gyp/16.3.0/deps/openssl/config -I/home/qwaz/.node-gyp/16.3.0/deps/openssl/openssl/include -I/home/qwaz/.node-gyp/16.3.0/deps/uv/include -I/home/qwaz/.node-gyp/16.3.0/deps/zlib -I/home/qwaz/.node-gyp/16.3.0/deps/v8/include -I../src/libsass/include  -fPIC -pthread -Wall -Wextra -Wno-unused-parameter -m64 -O3 -fno-omit-frame-pointer -std=gnu++14 -std=c++0x -fexceptions -frtti -MMD -MF ./Release/.deps/Release/obj.target/libsass/src/libsass/src/lexer.o.d.raw   -c -o Release/obj.target/libsass/src/libsass/src/lexer.o ../src/libsass/src/lexer.cpp
843 error   g++ '-DNODE_GYP_MODULE_NAME=libsass' '-DUSING_UV_SHARED=1' '-DUSING_V8_SHARED=1' '-DV8_DEPRECATION_WARNINGS=1' '-DV8_DEPRECATION_WARNINGS' '-DV8_IMMINENT_DEPRECATION_WARNINGS' '-D_GLIBCXX_USE_CXX11_ABI=1' '-D_LARGEFILE_SOURCE' '-D_FILE_OFFSET_BITS=64' '-D__STDC_FORMAT_MACROS' '-DOPENSSL_NO_PINSHARED' '-DOPENSSL_THREADS' '-DLIBSASS_VERSION="3.5.5"' -I/home/qwaz/.node-gyp/16.3.0/include/node -I/home/qwaz/.node-gyp/16.3.0/src -I/home/qwaz/.node-gyp/16.3.0/deps/openssl/config -I/home/qwaz/.node-gyp/16.3.0/deps/openssl/openssl/include -I/home/qwaz/.node-gyp/16.3.0/deps/uv/include -I/home/qwaz/.node-gyp/16.3.0/deps/zlib -I/home/qwaz/.node-gyp/16.3.0/deps/v8/include -I../src/libsass/include  -fPIC -pthread -Wall -Wextra -Wno-unused-parameter -m64 -O3 -fno-omit-frame-pointer -std=gnu++14 -std=c++0x -fexceptions -frtti -MMD -MF ./Release/.deps/Release/obj.target/libsass/src/libsass/src/listize.o.d.raw   -c -o Release/obj.target/libsass/src/libsass/src/listize.o ../src/libsass/src/listize.cpp
843 error   g++ '-DNODE_GYP_MODULE_NAME=libsass' '-DUSING_UV_SHARED=1' '-DUSING_V8_SHARED=1' '-DV8_DEPRECATION_WARNINGS=1' '-DV8_DEPRECATION_WARNINGS' '-DV8_IMMINENT_DEPRECATION_WARNINGS' '-D_GLIBCXX_USE_CXX11_ABI=1' '-D_LARGEFILE_SOURCE' '-D_FILE_OFFSET_BITS=64' '-D__STDC_FORMAT_MACROS' '-DOPENSSL_NO_PINSHARED' '-DOPENSSL_THREADS' '-DLIBSASS_VERSION="3.5.5"' -I/home/qwaz/.node-gyp/16.3.0/include/node -I/home/qwaz/.node-gyp/16.3.0/src -I/home/qwaz/.node-gyp/16.3.0/deps/openssl/config -I/home/qwaz/.node-gyp/16.3.0/deps/openssl/openssl/include -I/home/qwaz/.node-gyp/16.3.0/deps/uv/include -I/home/qwaz/.node-gyp/16.3.0/deps/zlib -I/home/qwaz/.node-gyp/16.3.0/deps/v8/include -I../src/libsass/include  -fPIC -pthread -Wall -Wextra -Wno-unused-parameter -m64 -O3 -fno-omit-frame-pointer -std=gnu++14 -std=c++0x -fexceptions -frtti -MMD -MF ./Release/.deps/Release/obj.target/libsass/src/libsass/src/memory/SharedPtr.o.d.raw   -c -o Release/obj.target/libsass/src/libsass/src/memory/SharedPtr.o ../src/libsass/src/memory/SharedPtr.cpp
843 error   g++ '-DNODE_GYP_MODULE_NAME=libsass' '-DUSING_UV_SHARED=1' '-DUSING_V8_SHARED=1' '-DV8_DEPRECATION_WARNINGS=1' '-DV8_DEPRECATION_WARNINGS' '-DV8_IMMINENT_DEPRECATION_WARNINGS' '-D_GLIBCXX_USE_CXX11_ABI=1' '-D_LARGEFILE_SOURCE' '-D_FILE_OFFSET_BITS=64' '-D__STDC_FORMAT_MACROS' '-DOPENSSL_NO_PINSHARED' '-DOPENSSL_THREADS' '-DLIBSASS_VERSION="3.5.5"' -I/home/qwaz/.node-gyp/16.3.0/include/node -I/home/qwaz/.node-gyp/16.3.0/src -I/home/qwaz/.node-gyp/16.3.0/deps/openssl/config -I/home/qwaz/.node-gyp/16.3.0/deps/openssl/openssl/include -I/home/qwaz/.node-gyp/16.3.0/deps/uv/include -I/home/qwaz/.node-gyp/16.3.0/deps/zlib -I/home/qwaz/.node-gyp/16.3.0/deps/v8/include -I../src/libsass/include  -fPIC -pthread -Wall -Wextra -Wno-unused-parameter -m64 -O3 -fno-omit-frame-pointer -std=gnu++14 -std=c++0x -fexceptions -frtti -MMD -MF ./Release/.deps/Release/obj.target/libsass/src/libsass/src/node.o.d.raw   -c -o Release/obj.target/libsass/src/libsass/src/node.o ../src/libsass/src/node.cpp
843 error   g++ '-DNODE_GYP_MODULE_NAME=libsass' '-DUSING_UV_SHARED=1' '-DUSING_V8_SHARED=1' '-DV8_DEPRECATION_WARNINGS=1' '-DV8_DEPRECATION_WARNINGS' '-DV8_IMMINENT_DEPRECATION_WARNINGS' '-D_GLIBCXX_USE_CXX11_ABI=1' '-D_LARGEFILE_SOURCE' '-D_FILE_OFFSET_BITS=64' '-D__STDC_FORMAT_MACROS' '-DOPENSSL_NO_PINSHARED' '-DOPENSSL_THREADS' '-DLIBSASS_VERSION="3.5.5"' -I/home/qwaz/.node-gyp/16.3.0/include/node -I/home/qwaz/.node-gyp/16.3.0/src -I/home/qwaz/.node-gyp/16.3.0/deps/openssl/config -I/home/qwaz/.node-gyp/16.3.0/deps/openssl/openssl/include -I/home/qwaz/.node-gyp/16.3.0/deps/uv/include -I/home/qwaz/.node-gyp/16.3.0/deps/zlib -I/home/qwaz/.node-gyp/16.3.0/deps/v8/include -I../src/libsass/include  -fPIC -pthread -Wall -Wextra -Wno-unused-parameter -m64 -O3 -fno-omit-frame-pointer -std=gnu++14 -std=c++0x -fexceptions -frtti -MMD -MF ./Release/.deps/Release/obj.target/libsass/src/libsass/src/operators.o.d.raw   -c -o Release/obj.target/libsass/src/libsass/src/operators.o ../src/libsass/src/operators.cpp
843 error   g++ '-DNODE_GYP_MODULE_NAME=libsass' '-DUSING_UV_SHARED=1' '-DUSING_V8_SHARED=1' '-DV8_DEPRECATION_WARNINGS=1' '-DV8_DEPRECATION_WARNINGS' '-DV8_IMMINENT_DEPRECATION_WARNINGS' '-D_GLIBCXX_USE_CXX11_ABI=1' '-D_LARGEFILE_SOURCE' '-D_FILE_OFFSET_BITS=64' '-D__STDC_FORMAT_MACROS' '-DOPENSSL_NO_PINSHARED' '-DOPENSSL_THREADS' '-DLIBSASS_VERSION="3.5.5"' -I/home/qwaz/.node-gyp/16.3.0/include/node -I/home/qwaz/.node-gyp/16.3.0/src -I/home/qwaz/.node-gyp/16.3.0/deps/openssl/config -I/home/qwaz/.node-gyp/16.3.0/deps/openssl/openssl/include -I/home/qwaz/.node-gyp/16.3.0/deps/uv/include -I/home/qwaz/.node-gyp/16.3.0/deps/zlib -I/home/qwaz/.node-gyp/16.3.0/deps/v8/include -I../src/libsass/include  -fPIC -pthread -Wall -Wextra -Wno-unused-parameter -m64 -O3 -fno-omit-frame-pointer -std=gnu++14 -std=c++0x -fexceptions -frtti -MMD -MF ./Release/.deps/Release/obj.target/libsass/src/libsass/src/output.o.d.raw   -c -o Release/obj.target/libsass/src/libsass/src/output.o ../src/libsass/src/output.cpp
843 error   g++ '-DNODE_GYP_MODULE_NAME=libsass' '-DUSING_UV_SHARED=1' '-DUSING_V8_SHARED=1' '-DV8_DEPRECATION_WARNINGS=1' '-DV8_DEPRECATION_WARNINGS' '-DV8_IMMINENT_DEPRECATION_WARNINGS' '-D_GLIBCXX_USE_CXX11_ABI=1' '-D_LARGEFILE_SOURCE' '-D_FILE_OFFSET_BITS=64' '-D__STDC_FORMAT_MACROS' '-DOPENSSL_NO_PINSHARED' '-DOPENSSL_THREADS' '-DLIBSASS_VERSION="3.5.5"' -I/home/qwaz/.node-gyp/16.3.0/include/node -I/home/qwaz/.node-gyp/16.3.0/src -I/home/qwaz/.node-gyp/16.3.0/deps/openssl/config -I/home/qwaz/.node-gyp/16.3.0/deps/openssl/openssl/include -I/home/qwaz/.node-gyp/16.3.0/deps/uv/include -I/home/qwaz/.node-gyp/16.3.0/deps/zlib -I/home/qwaz/.node-gyp/16.3.0/deps/v8/include -I../src/libsass/include  -fPIC -pthread -Wall -Wextra -Wno-unused-parameter -m64 -O3 -fno-omit-frame-pointer -std=gnu++14 -std=c++0x -fexceptions -frtti -MMD -MF ./Release/.deps/Release/obj.target/libsass/src/libsass/src/parser.o.d.raw   -c -o Release/obj.target/libsass/src/libsass/src/parser.o ../src/libsass/src/parser.cpp
843 error   g++ '-DNODE_GYP_MODULE_NAME=libsass' '-DUSING_UV_SHARED=1' '-DUSING_V8_SHARED=1' '-DV8_DEPRECATION_WARNINGS=1' '-DV8_DEPRECATION_WARNINGS' '-DV8_IMMINENT_DEPRECATION_WARNINGS' '-D_GLIBCXX_USE_CXX11_ABI=1' '-D_LARGEFILE_SOURCE' '-D_FILE_OFFSET_BITS=64' '-D__STDC_FORMAT_MACROS' '-DOPENSSL_NO_PINSHARED' '-DOPENSSL_THREADS' '-DLIBSASS_VERSION="3.5.5"' -I/home/qwaz/.node-gyp/16.3.0/include/node -I/home/qwaz/.node-gyp/16.3.0/src -I/home/qwaz/.node-gyp/16.3.0/deps/openssl/config -I/home/qwaz/.node-gyp/16.3.0/deps/openssl/openssl/include -I/home/qwaz/.node-gyp/16.3.0/deps/uv/include -I/home/qwaz/.node-gyp/16.3.0/deps/zlib -I/home/qwaz/.node-gyp/16.3.0/deps/v8/include -I../src/libsass/include  -fPIC -pthread -Wall -Wextra -Wno-unused-parameter -m64 -O3 -fno-omit-frame-pointer -std=gnu++14 -std=c++0x -fexceptions -frtti -MMD -MF ./Release/.deps/Release/obj.target/libsass/src/libsass/src/plugins.o.d.raw   -c -o Release/obj.target/libsass/src/libsass/src/plugins.o ../src/libsass/src/plugins.cpp
843 error   g++ '-DNODE_GYP_MODULE_NAME=libsass' '-DUSING_UV_SHARED=1' '-DUSING_V8_SHARED=1' '-DV8_DEPRECATION_WARNINGS=1' '-DV8_DEPRECATION_WARNINGS' '-DV8_IMMINENT_DEPRECATION_WARNINGS' '-D_GLIBCXX_USE_CXX11_ABI=1' '-D_LARGEFILE_SOURCE' '-D_FILE_OFFSET_BITS=64' '-D__STDC_FORMAT_MACROS' '-DOPENSSL_NO_PINSHARED' '-DOPENSSL_THREADS' '-DLIBSASS_VERSION="3.5.5"' -I/home/qwaz/.node-gyp/16.3.0/include/node -I/home/qwaz/.node-gyp/16.3.0/src -I/home/qwaz/.node-gyp/16.3.0/deps/openssl/config -I/home/qwaz/.node-gyp/16.3.0/deps/openssl/openssl/include -I/home/qwaz/.node-gyp/16.3.0/deps/uv/include -I/home/qwaz/.node-gyp/16.3.0/deps/zlib -I/home/qwaz/.node-gyp/16.3.0/deps/v8/include -I../src/libsass/include  -fPIC -pthread -Wall -Wextra -Wno-unused-parameter -m64 -O3 -fno-omit-frame-pointer -std=gnu++14 -std=c++0x -fexceptions -frtti -MMD -MF ./Release/.deps/Release/obj.target/libsass/src/libsass/src/position.o.d.raw   -c -o Release/obj.target/libsass/src/libsass/src/position.o ../src/libsass/src/position.cpp
843 error   g++ '-DNODE_GYP_MODULE_NAME=libsass' '-DUSING_UV_SHARED=1' '-DUSING_V8_SHARED=1' '-DV8_DEPRECATION_WARNINGS=1' '-DV8_DEPRECATION_WARNINGS' '-DV8_IMMINENT_DEPRECATION_WARNINGS' '-D_GLIBCXX_USE_CXX11_ABI=1' '-D_LARGEFILE_SOURCE' '-D_FILE_OFFSET_BITS=64' '-D__STDC_FORMAT_MACROS' '-DOPENSSL_NO_PINSHARED' '-DOPENSSL_THREADS' '-DLIBSASS_VERSION="3.5.5"' -I/home/qwaz/.node-gyp/16.3.0/include/node -I/home/qwaz/.node-gyp/16.3.0/src -I/home/qwaz/.node-gyp/16.3.0/deps/openssl/config -I/home/qwaz/.node-gyp/16.3.0/deps/openssl/openssl/include -I/home/qwaz/.node-gyp/16.3.0/deps/uv/include -I/home/qwaz/.node-gyp/16.3.0/deps/zlib -I/home/qwaz/.node-gyp/16.3.0/deps/v8/include -I../src/libsass/include  -fPIC -pthread -Wall -Wextra -Wno-unused-parameter -m64 -O3 -fno-omit-frame-pointer -std=gnu++14 -std=c++0x -fexceptions -frtti -MMD -MF ./Release/.deps/Release/obj.target/libsass/src/libsass/src/prelexer.o.d.raw   -c -o Release/obj.target/libsass/src/libsass/src/prelexer.o ../src/libsass/src/prelexer.cpp
843 error   g++ '-DNODE_GYP_MODULE_NAME=libsass' '-DUSING_UV_SHARED=1' '-DUSING_V8_SHARED=1' '-DV8_DEPRECATION_WARNINGS=1' '-DV8_DEPRECATION_WARNINGS' '-DV8_IMMINENT_DEPRECATION_WARNINGS' '-D_GLIBCXX_USE_CXX11_ABI=1' '-D_LARGEFILE_SOURCE' '-D_FILE_OFFSET_BITS=64' '-D__STDC_FORMAT_MACROS' '-DOPENSSL_NO_PINSHARED' '-DOPENSSL_THREADS' '-DLIBSASS_VERSION="3.5.5"' -I/home/qwaz/.node-gyp/16.3.0/include/node -I/home/qwaz/.node-gyp/16.3.0/src -I/home/qwaz/.node-gyp/16.3.0/deps/openssl/config -I/home/qwaz/.node-gyp/16.3.0/deps/openssl/openssl/include -I/home/qwaz/.node-gyp/16.3.0/deps/uv/include -I/home/qwaz/.node-gyp/16.3.0/deps/zlib -I/home/qwaz/.node-gyp/16.3.0/deps/v8/include -I../src/libsass/include  -fPIC -pthread -Wall -Wextra -Wno-unused-parameter -m64 -O3 -fno-omit-frame-pointer -std=gnu++14 -std=c++0x -fexceptions -frtti -MMD -MF ./Release/.deps/Release/obj.target/libsass/src/libsass/src/remove_placeholders.o.d.raw   -c -o Release/obj.target/libsass/src/libsass/src/remove_placeholders.o ../src/libsass/src/remove_placeholders.cpp
843 error   g++ '-DNODE_GYP_MODULE_NAME=libsass' '-DUSING_UV_SHARED=1' '-DUSING_V8_SHARED=1' '-DV8_DEPRECATION_WARNINGS=1' '-DV8_DEPRECATION_WARNINGS' '-DV8_IMMINENT_DEPRECATION_WARNINGS' '-D_GLIBCXX_USE_CXX11_ABI=1' '-D_LARGEFILE_SOURCE' '-D_FILE_OFFSET_BITS=64' '-D__STDC_FORMAT_MACROS' '-DOPENSSL_NO_PINSHARED' '-DOPENSSL_THREADS' '-DLIBSASS_VERSION="3.5.5"' -I/home/qwaz/.node-gyp/16.3.0/include/node -I/home/qwaz/.node-gyp/16.3.0/src -I/home/qwaz/.node-gyp/16.3.0/deps/openssl/config -I/home/qwaz/.node-gyp/16.3.0/deps/openssl/openssl/include -I/home/qwaz/.node-gyp/16.3.0/deps/uv/include -I/home/qwaz/.node-gyp/16.3.0/deps/zlib -I/home/qwaz/.node-gyp/16.3.0/deps/v8/include -I../src/libsass/include  -fPIC -pthread -Wall -Wextra -Wno-unused-parameter -m64 -O3 -fno-omit-frame-pointer -std=gnu++14 -std=c++0x -fexceptions -frtti -MMD -MF ./Release/.deps/Release/obj.target/libsass/src/libsass/src/sass.o.d.raw   -c -o Release/obj.target/libsass/src/libsass/src/sass.o ../src/libsass/src/sass.cpp
843 error   g++ '-DNODE_GYP_MODULE_NAME=libsass' '-DUSING_UV_SHARED=1' '-DUSING_V8_SHARED=1' '-DV8_DEPRECATION_WARNINGS=1' '-DV8_DEPRECATION_WARNINGS' '-DV8_IMMINENT_DEPRECATION_WARNINGS' '-D_GLIBCXX_USE_CXX11_ABI=1' '-D_LARGEFILE_SOURCE' '-D_FILE_OFFSET_BITS=64' '-D__STDC_FORMAT_MACROS' '-DOPENSSL_NO_PINSHARED' '-DOPENSSL_THREADS' '-DLIBSASS_VERSION="3.5.5"' -I/home/qwaz/.node-gyp/16.3.0/include/node -I/home/qwaz/.node-gyp/16.3.0/src -I/home/qwaz/.node-gyp/16.3.0/deps/openssl/config -I/home/qwaz/.node-gyp/16.3.0/deps/openssl/openssl/include -I/home/qwaz/.node-gyp/16.3.0/deps/uv/include -I/home/qwaz/.node-gyp/16.3.0/deps/zlib -I/home/qwaz/.node-gyp/16.3.0/deps/v8/include -I../src/libsass/include  -fPIC -pthread -Wall -Wextra -Wno-unused-parameter -m64 -O3 -fno-omit-frame-pointer -std=gnu++14 -std=c++0x -fexceptions -frtti -MMD -MF ./Release/.deps/Release/obj.target/libsass/src/libsass/src/sass2scss.o.d.raw   -c -o Release/obj.target/libsass/src/libsass/src/sass2scss.o ../src/libsass/src/sass2scss.cpp
843 error   g++ '-DNODE_GYP_MODULE_NAME=libsass' '-DUSING_UV_SHARED=1' '-DUSING_V8_SHARED=1' '-DV8_DEPRECATION_WARNINGS=1' '-DV8_DEPRECATION_WARNINGS' '-DV8_IMMINENT_DEPRECATION_WARNINGS' '-D_GLIBCXX_USE_CXX11_ABI=1' '-D_LARGEFILE_SOURCE' '-D_FILE_OFFSET_BITS=64' '-D__STDC_FORMAT_MACROS' '-DOPENSSL_NO_PINSHARED' '-DOPENSSL_THREADS' '-DLIBSASS_VERSION="3.5.5"' -I/home/qwaz/.node-gyp/16.3.0/include/node -I/home/qwaz/.node-gyp/16.3.0/src -I/home/qwaz/.node-gyp/16.3.0/deps/openssl/config -I/home/qwaz/.node-gyp/16.3.0/deps/openssl/openssl/include -I/home/qwaz/.node-gyp/16.3.0/deps/uv/include -I/home/qwaz/.node-gyp/16.3.0/deps/zlib -I/home/qwaz/.node-gyp/16.3.0/deps/v8/include -I../src/libsass/include  -fPIC -pthread -Wall -Wextra -Wno-unused-parameter -m64 -O3 -fno-omit-frame-pointer -std=gnu++14 -std=c++0x -fexceptions -frtti -MMD -MF ./Release/.deps/Release/obj.target/libsass/src/libsass/src/sass_context.o.d.raw   -c -o Release/obj.target/libsass/src/libsass/src/sass_context.o ../src/libsass/src/sass_context.cpp
843 error   g++ '-DNODE_GYP_MODULE_NAME=libsass' '-DUSING_UV_SHARED=1' '-DUSING_V8_SHARED=1' '-DV8_DEPRECATION_WARNINGS=1' '-DV8_DEPRECATION_WARNINGS' '-DV8_IMMINENT_DEPRECATION_WARNINGS' '-D_GLIBCXX_USE_CXX11_ABI=1' '-D_LARGEFILE_SOURCE' '-D_FILE_OFFSET_BITS=64' '-D__STDC_FORMAT_MACROS' '-DOPENSSL_NO_PINSHARED' '-DOPENSSL_THREADS' '-DLIBSASS_VERSION="3.5.5"' -I/home/qwaz/.node-gyp/16.3.0/include/node -I/home/qwaz/.node-gyp/16.3.0/src -I/home/qwaz/.node-gyp/16.3.0/deps/openssl/config -I/home/qwaz/.node-gyp/16.3.0/deps/openssl/openssl/include -I/home/qwaz/.node-gyp/16.3.0/deps/uv/include -I/home/qwaz/.node-gyp/16.3.0/deps/zlib -I/home/qwaz/.node-gyp/16.3.0/deps/v8/include -I../src/libsass/include  -fPIC -pthread -Wall -Wextra -Wno-unused-parameter -m64 -O3 -fno-omit-frame-pointer -std=gnu++14 -std=c++0x -fexceptions -frtti -MMD -MF ./Release/.deps/Release/obj.target/libsass/src/libsass/src/sass_functions.o.d.raw   -c -o Release/obj.target/libsass/src/libsass/src/sass_functions.o ../src/libsass/src/sass_functions.cpp
843 error   g++ '-DNODE_GYP_MODULE_NAME=libsass' '-DUSING_UV_SHARED=1' '-DUSING_V8_SHARED=1' '-DV8_DEPRECATION_WARNINGS=1' '-DV8_DEPRECATION_WARNINGS' '-DV8_IMMINENT_DEPRECATION_WARNINGS' '-D_GLIBCXX_USE_CXX11_ABI=1' '-D_LARGEFILE_SOURCE' '-D_FILE_OFFSET_BITS=64' '-D__STDC_FORMAT_MACROS' '-DOPENSSL_NO_PINSHARED' '-DOPENSSL_THREADS' '-DLIBSASS_VERSION="3.5.5"' -I/home/qwaz/.node-gyp/16.3.0/include/node -I/home/qwaz/.node-gyp/16.3.0/src -I/home/qwaz/.node-gyp/16.3.0/deps/openssl/config -I/home/qwaz/.node-gyp/16.3.0/deps/openssl/openssl/include -I/home/qwaz/.node-gyp/16.3.0/deps/uv/include -I/home/qwaz/.node-gyp/16.3.0/deps/zlib -I/home/qwaz/.node-gyp/16.3.0/deps/v8/include -I../src/libsass/include  -fPIC -pthread -Wall -Wextra -Wno-unused-parameter -m64 -O3 -fno-omit-frame-pointer -std=gnu++14 -std=c++0x -fexceptions -frtti -MMD -MF ./Release/.deps/Release/obj.target/libsass/src/libsass/src/sass_util.o.d.raw   -c -o Release/obj.target/libsass/src/libsass/src/sass_util.o ../src/libsass/src/sass_util.cpp
843 error   g++ '-DNODE_GYP_MODULE_NAME=libsass' '-DUSING_UV_SHARED=1' '-DUSING_V8_SHARED=1' '-DV8_DEPRECATION_WARNINGS=1' '-DV8_DEPRECATION_WARNINGS' '-DV8_IMMINENT_DEPRECATION_WARNINGS' '-D_GLIBCXX_USE_CXX11_ABI=1' '-D_LARGEFILE_SOURCE' '-D_FILE_OFFSET_BITS=64' '-D__STDC_FORMAT_MACROS' '-DOPENSSL_NO_PINSHARED' '-DOPENSSL_THREADS' '-DLIBSASS_VERSION="3.5.5"' -I/home/qwaz/.node-gyp/16.3.0/include/node -I/home/qwaz/.node-gyp/16.3.0/src -I/home/qwaz/.node-gyp/16.3.0/deps/openssl/config -I/home/qwaz/.node-gyp/16.3.0/deps/openssl/openssl/include -I/home/qwaz/.node-gyp/16.3.0/deps/uv/include -I/home/qwaz/.node-gyp/16.3.0/deps/zlib -I/home/qwaz/.node-gyp/16.3.0/deps/v8/include -I../src/libsass/include  -fPIC -pthread -Wall -Wextra -Wno-unused-parameter -m64 -O3 -fno-omit-frame-pointer -std=gnu++14 -std=c++0x -fexceptions -frtti -MMD -MF ./Release/.deps/Release/obj.target/libsass/src/libsass/src/sass_values.o.d.raw   -c -o Release/obj.target/libsass/src/libsass/src/sass_values.o ../src/libsass/src/sass_values.cpp
843 error   g++ '-DNODE_GYP_MODULE_NAME=libsass' '-DUSING_UV_SHARED=1' '-DUSING_V8_SHARED=1' '-DV8_DEPRECATION_WARNINGS=1' '-DV8_DEPRECATION_WARNINGS' '-DV8_IMMINENT_DEPRECATION_WARNINGS' '-D_GLIBCXX_USE_CXX11_ABI=1' '-D_LARGEFILE_SOURCE' '-D_FILE_OFFSET_BITS=64' '-D__STDC_FORMAT_MACROS' '-DOPENSSL_NO_PINSHARED' '-DOPENSSL_THREADS' '-DLIBSASS_VERSION="3.5.5"' -I/home/qwaz/.node-gyp/16.3.0/include/node -I/home/qwaz/.node-gyp/16.3.0/src -I/home/qwaz/.node-gyp/16.3.0/deps/openssl/config -I/home/qwaz/.node-gyp/16.3.0/deps/openssl/openssl/include -I/home/qwaz/.node-gyp/16.3.0/deps/uv/include -I/home/qwaz/.node-gyp/16.3.0/deps/zlib -I/home/qwaz/.node-gyp/16.3.0/deps/v8/include -I../src/libsass/include  -fPIC -pthread -Wall -Wextra -Wno-unused-parameter -m64 -O3 -fno-omit-frame-pointer -std=gnu++14 -std=c++0x -fexceptions -frtti -MMD -MF ./Release/.deps/Release/obj.target/libsass/src/libsass/src/source_map.o.d.raw   -c -o Release/obj.target/libsass/src/libsass/src/source_map.o ../src/libsass/src/source_map.cpp
843 error   g++ '-DNODE_GYP_MODULE_NAME=libsass' '-DUSING_UV_SHARED=1' '-DUSING_V8_SHARED=1' '-DV8_DEPRECATION_WARNINGS=1' '-DV8_DEPRECATION_WARNINGS' '-DV8_IMMINENT_DEPRECATION_WARNINGS' '-D_GLIBCXX_USE_CXX11_ABI=1' '-D_LARGEFILE_SOURCE' '-D_FILE_OFFSET_BITS=64' '-D__STDC_FORMAT_MACROS' '-DOPENSSL_NO_PINSHARED' '-DOPENSSL_THREADS' '-DLIBSASS_VERSION="3.5.5"' -I/home/qwaz/.node-gyp/16.3.0/include/node -I/home/qwaz/.node-gyp/16.3.0/src -I/home/qwaz/.node-gyp/16.3.0/deps/openssl/config -I/home/qwaz/.node-gyp/16.3.0/deps/openssl/openssl/include -I/home/qwaz/.node-gyp/16.3.0/deps/uv/include -I/home/qwaz/.node-gyp/16.3.0/deps/zlib -I/home/qwaz/.node-gyp/16.3.0/deps/v8/include -I../src/libsass/include  -fPIC -pthread -Wall -Wextra -Wno-unused-parameter -m64 -O3 -fno-omit-frame-pointer -std=gnu++14 -std=c++0x -fexceptions -frtti -MMD -MF ./Release/.deps/Release/obj.target/libsass/src/libsass/src/subset_map.o.d.raw   -c -o Release/obj.target/libsass/src/libsass/src/subset_map.o ../src/libsass/src/subset_map.cpp
843 error   g++ '-DNODE_GYP_MODULE_NAME=libsass' '-DUSING_UV_SHARED=1' '-DUSING_V8_SHARED=1' '-DV8_DEPRECATION_WARNINGS=1' '-DV8_DEPRECATION_WARNINGS' '-DV8_IMMINENT_DEPRECATION_WARNINGS' '-D_GLIBCXX_USE_CXX11_ABI=1' '-D_LARGEFILE_SOURCE' '-D_FILE_OFFSET_BITS=64' '-D__STDC_FORMAT_MACROS' '-DOPENSSL_NO_PINSHARED' '-DOPENSSL_THREADS' '-DLIBSASS_VERSION="3.5.5"' -I/home/qwaz/.node-gyp/16.3.0/include/node -I/home/qwaz/.node-gyp/16.3.0/src -I/home/qwaz/.node-gyp/16.3.0/deps/openssl/config -I/home/qwaz/.node-gyp/16.3.0/deps/openssl/openssl/include -I/home/qwaz/.node-gyp/16.3.0/deps/uv/include -I/home/qwaz/.node-gyp/16.3.0/deps/zlib -I/home/qwaz/.node-gyp/16.3.0/deps/v8/include -I../src/libsass/include  -fPIC -pthread -Wall -Wextra -Wno-unused-parameter -m64 -O3 -fno-omit-frame-pointer -std=gnu++14 -std=c++0x -fexceptions -frtti -MMD -MF ./Release/.deps/Release/obj.target/libsass/src/libsass/src/to_c.o.d.raw   -c -o Release/obj.target/libsass/src/libsass/src/to_c.o ../src/libsass/src/to_c.cpp
843 error   g++ '-DNODE_GYP_MODULE_NAME=libsass' '-DUSING_UV_SHARED=1' '-DUSING_V8_SHARED=1' '-DV8_DEPRECATION_WARNINGS=1' '-DV8_DEPRECATION_WARNINGS' '-DV8_IMMINENT_DEPRECATION_WARNINGS' '-D_GLIBCXX_USE_CXX11_ABI=1' '-D_LARGEFILE_SOURCE' '-D_FILE_OFFSET_BITS=64' '-D__STDC_FORMAT_MACROS' '-DOPENSSL_NO_PINSHARED' '-DOPENSSL_THREADS' '-DLIBSASS_VERSION="3.5.5"' -I/home/qwaz/.node-gyp/16.3.0/include/node -I/home/qwaz/.node-gyp/16.3.0/src -I/home/qwaz/.node-gyp/16.3.0/deps/openssl/config -I/home/qwaz/.node-gyp/16.3.0/deps/openssl/openssl/include -I/home/qwaz/.node-gyp/16.3.0/deps/uv/include -I/home/qwaz/.node-gyp/16.3.0/deps/zlib -I/home/qwaz/.node-gyp/16.3.0/deps/v8/include -I../src/libsass/include  -fPIC -pthread -Wall -Wextra -Wno-unused-parameter -m64 -O3 -fno-omit-frame-pointer -std=gnu++14 -std=c++0x -fexceptions -frtti -MMD -MF ./Release/.deps/Release/obj.target/libsass/src/libsass/src/to_value.o.d.raw   -c -o Release/obj.target/libsass/src/libsass/src/to_value.o ../src/libsass/src/to_value.cpp
843 error   g++ '-DNODE_GYP_MODULE_NAME=libsass' '-DUSING_UV_SHARED=1' '-DUSING_V8_SHARED=1' '-DV8_DEPRECATION_WARNINGS=1' '-DV8_DEPRECATION_WARNINGS' '-DV8_IMMINENT_DEPRECATION_WARNINGS' '-D_GLIBCXX_USE_CXX11_ABI=1' '-D_LARGEFILE_SOURCE' '-D_FILE_OFFSET_BITS=64' '-D__STDC_FORMAT_MACROS' '-DOPENSSL_NO_PINSHARED' '-DOPENSSL_THREADS' '-DLIBSASS_VERSION="3.5.5"' -I/home/qwaz/.node-gyp/16.3.0/include/node -I/home/qwaz/.node-gyp/16.3.0/src -I/home/qwaz/.node-gyp/16.3.0/deps/openssl/config -I/home/qwaz/.node-gyp/16.3.0/deps/openssl/openssl/include -I/home/qwaz/.node-gyp/16.3.0/deps/uv/include -I/home/qwaz/.node-gyp/16.3.0/deps/zlib -I/home/qwaz/.node-gyp/16.3.0/deps/v8/include -I../src/libsass/include  -fPIC -pthread -Wall -Wextra -Wno-unused-parameter -m64 -O3 -fno-omit-frame-pointer -std=gnu++14 -std=c++0x -fexceptions -frtti -MMD -MF ./Release/.deps/Release/obj.target/libsass/src/libsass/src/units.o.d.raw   -c -o Release/obj.target/libsass/src/libsass/src/units.o ../src/libsass/src/units.cpp
843 error   g++ '-DNODE_GYP_MODULE_NAME=libsass' '-DUSING_UV_SHARED=1' '-DUSING_V8_SHARED=1' '-DV8_DEPRECATION_WARNINGS=1' '-DV8_DEPRECATION_WARNINGS' '-DV8_IMMINENT_DEPRECATION_WARNINGS' '-D_GLIBCXX_USE_CXX11_ABI=1' '-D_LARGEFILE_SOURCE' '-D_FILE_OFFSET_BITS=64' '-D__STDC_FORMAT_MACROS' '-DOPENSSL_NO_PINSHARED' '-DOPENSSL_THREADS' '-DLIBSASS_VERSION="3.5.5"' -I/home/qwaz/.node-gyp/16.3.0/include/node -I/home/qwaz/.node-gyp/16.3.0/src -I/home/qwaz/.node-gyp/16.3.0/deps/openssl/config -I/home/qwaz/.node-gyp/16.3.0/deps/openssl/openssl/include -I/home/qwaz/.node-gyp/16.3.0/deps/uv/include -I/home/qwaz/.node-gyp/16.3.0/deps/zlib -I/home/qwaz/.node-gyp/16.3.0/deps/v8/include -I../src/libsass/include  -fPIC -pthread -Wall -Wextra -Wno-unused-parameter -m64 -O3 -fno-omit-frame-pointer -std=gnu++14 -std=c++0x -fexceptions -frtti -MMD -MF ./Release/.deps/Release/obj.target/libsass/src/libsass/src/utf8_string.o.d.raw   -c -o Release/obj.target/libsass/src/libsass/src/utf8_string.o ../src/libsass/src/utf8_string.cpp
843 error   g++ '-DNODE_GYP_MODULE_NAME=libsass' '-DUSING_UV_SHARED=1' '-DUSING_V8_SHARED=1' '-DV8_DEPRECATION_WARNINGS=1' '-DV8_DEPRECATION_WARNINGS' '-DV8_IMMINENT_DEPRECATION_WARNINGS' '-D_GLIBCXX_USE_CXX11_ABI=1' '-D_LARGEFILE_SOURCE' '-D_FILE_OFFSET_BITS=64' '-D__STDC_FORMAT_MACROS' '-DOPENSSL_NO_PINSHARED' '-DOPENSSL_THREADS' '-DLIBSASS_VERSION="3.5.5"' -I/home/qwaz/.node-gyp/16.3.0/include/node -I/home/qwaz/.node-gyp/16.3.0/src -I/home/qwaz/.node-gyp/16.3.0/deps/openssl/config -I/home/qwaz/.node-gyp/16.3.0/deps/openssl/openssl/include -I/home/qwaz/.node-gyp/16.3.0/deps/uv/include -I/home/qwaz/.node-gyp/16.3.0/deps/zlib -I/home/qwaz/.node-gyp/16.3.0/deps/v8/include -I../src/libsass/include  -fPIC -pthread -Wall -Wextra -Wno-unused-parameter -m64 -O3 -fno-omit-frame-pointer -std=gnu++14 -std=c++0x -fexceptions -frtti -MMD -MF ./Release/.deps/Release/obj.target/libsass/src/libsass/src/util.o.d.raw   -c -o Release/obj.target/libsass/src/libsass/src/util.o ../src/libsass/src/util.cpp
843 error   g++ '-DNODE_GYP_MODULE_NAME=libsass' '-DUSING_UV_SHARED=1' '-DUSING_V8_SHARED=1' '-DV8_DEPRECATION_WARNINGS=1' '-DV8_DEPRECATION_WARNINGS' '-DV8_IMMINENT_DEPRECATION_WARNINGS' '-D_GLIBCXX_USE_CXX11_ABI=1' '-D_LARGEFILE_SOURCE' '-D_FILE_OFFSET_BITS=64' '-D__STDC_FORMAT_MACROS' '-DOPENSSL_NO_PINSHARED' '-DOPENSSL_THREADS' '-DLIBSASS_VERSION="3.5.5"' -I/home/qwaz/.node-gyp/16.3.0/include/node -I/home/qwaz/.node-gyp/16.3.0/src -I/home/qwaz/.node-gyp/16.3.0/deps/openssl/config -I/home/qwaz/.node-gyp/16.3.0/deps/openssl/openssl/include -I/home/qwaz/.node-gyp/16.3.0/deps/uv/include -I/home/qwaz/.node-gyp/16.3.0/deps/zlib -I/home/qwaz/.node-gyp/16.3.0/deps/v8/include -I../src/libsass/include  -fPIC -pthread -Wall -Wextra -Wno-unused-parameter -m64 -O3 -fno-omit-frame-pointer -std=gnu++14 -std=c++0x -fexceptions -frtti -MMD -MF ./Release/.deps/Release/obj.target/libsass/src/libsass/src/values.o.d.raw   -c -o Release/obj.target/libsass/src/libsass/src/values.o ../src/libsass/src/values.cpp
843 error   rm -f Release/obj.target/src/sass.a && ar crs Release/obj.target/src/sass.a Release/obj.target/libsass/src/libsass/src/ast.o Release/obj.target/libsass/src/libsass/src/ast_fwd_decl.o Release/obj.target/libsass/src/libsass/src/backtrace.o Release/obj.target/libsass/src/libsass/src/base64vlq.o Release/obj.target/libsass/src/libsass/src/bind.o Release/obj.target/libsass/src/libsass/src/cencode.o Release/obj.target/libsass/src/libsass/src/check_nesting.o Release/obj.target/libsass/src/libsass/src/color_maps.o Release/obj.target/libsass/src/libsass/src/constants.o Release/obj.target/libsass/src/libsass/src/context.o Release/obj.target/libsass/src/libsass/src/cssize.o Release/obj.target/libsass/src/libsass/src/emitter.o Release/obj.target/libsass/src/libsass/src/environment.o Release/obj.target/libsass/src/libsass/src/error_handling.o Release/obj.target/libsass/src/libsass/src/eval.o Release/obj.target/libsass/src/libsass/src/expand.o Release/obj.target/libsass/src/libsass/src/extend.o Release/obj.target/libsass/src/libsass/src/file.o Release/obj.target/libsass/src/libsass/src/functions.o Release/obj.target/libsass/src/libsass/src/inspect.o Release/obj.target/libsass/src/libsass/src/json.o Release/obj.target/libsass/src/libsass/src/lexer.o Release/obj.target/libsass/src/libsass/src/listize.o Release/obj.target/libsass/src/libsass/src/memory/SharedPtr.o Release/obj.target/libsass/src/libsass/src/node.o Release/obj.target/libsass/src/libsass/src/operators.o Release/obj.target/libsass/src/libsass/src/output.o Release/obj.target/libsass/src/libsass/src/parser.o Release/obj.target/libsass/src/libsass/src/plugins.o Release/obj.target/libsass/src/libsass/src/position.o Release/obj.target/libsass/src/libsass/src/prelexer.o Release/obj.target/libsass/src/libsass/src/remove_placeholders.o Release/obj.target/libsass/src/libsass/src/sass.o Release/obj.target/libsass/src/libsass/src/sass2scss.o Release/obj.target/libsass/src/libsass/src/sass_context.o Release/obj.target/libsass/src/libsass/src/sass_functions.o Release/obj.target/libsass/src/libsass/src/sass_util.o Release/obj.target/libsass/src/libsass/src/sass_values.o Release/obj.target/libsass/src/libsass/src/source_map.o Release/obj.target/libsass/src/libsass/src/subset_map.o Release/obj.target/libsass/src/libsass/src/to_c.o Release/obj.target/libsass/src/libsass/src/to_value.o Release/obj.target/libsass/src/libsass/src/units.o Release/obj.target/libsass/src/libsass/src/utf8_string.o Release/obj.target/libsass/src/libsass/src/util.o Release/obj.target/libsass/src/libsass/src/values.o
843 error   rm -rf "Release/sass.a" && cp -af "Release/obj.target/src/sass.a" "Release/sass.a"
843 error   g++ '-DNODE_GYP_MODULE_NAME=binding' '-DUSING_UV_SHARED=1' '-DUSING_V8_SHARED=1' '-DV8_DEPRECATION_WARNINGS=1' '-DV8_DEPRECATION_WARNINGS' '-DV8_IMMINENT_DEPRECATION_WARNINGS' '-D_GLIBCXX_USE_CXX11_ABI=1' '-D_LARGEFILE_SOURCE' '-D_FILE_OFFSET_BITS=64' '-D__STDC_FORMAT_MACROS' '-DOPENSSL_NO_PINSHARED' '-DOPENSSL_THREADS' '-DBUILDING_NODE_EXTENSION' -I/home/qwaz/.node-gyp/16.3.0/include/node -I/home/qwaz/.node-gyp/16.3.0/src -I/home/qwaz/.node-gyp/16.3.0/deps/openssl/config -I/home/qwaz/.node-gyp/16.3.0/deps/openssl/openssl/include -I/home/qwaz/.node-gyp/16.3.0/deps/uv/include -I/home/qwaz/.node-gyp/16.3.0/deps/zlib -I/home/qwaz/.node-gyp/16.3.0/deps/v8/include -I../../nan -I../src/libsass/include  -fPIC -pthread -Wall -Wextra -Wno-unused-parameter -m64 -O3 -fno-omit-frame-pointer -fno-rtti -fno-exceptions -std=gnu++14 -std=c++0x -MMD -MF ./Release/.deps/Release/obj.target/binding/src/binding.o.d.raw   -c -o Release/obj.target/binding/src/binding.o ../src/binding.cpp
843 error make: Leaving directory '/home/qwaz/dev/GitHub/beginner-gulp/node_modules/node-sass/build'
844 error gyp info it worked if it ends with ok
844 error gyp verb cli [
844 error gyp verb cli   '/home/qwaz/.nvm/versions/node/v16.3.0/bin/node',
844 error gyp verb cli   '/home/qwaz/dev/GitHub/beginner-gulp/node_modules/node-gyp/bin/node-gyp.js',
844 error gyp verb cli   'rebuild',
844 error gyp verb cli   '--verbose',
844 error gyp verb cli   '--libsass_ext=',
844 error gyp verb cli   '--libsass_cflags=',
844 error gyp verb cli   '--libsass_ldflags=',
844 error gyp verb cli   '--libsass_library='
844 error gyp verb cli ]
844 error gyp info using node-gyp@3.8.0
844 error gyp info using node@16.3.0 | linux | x64
844 error gyp verb command rebuild []
844 error gyp verb command clean []
844 error gyp verb clean removing "build" directory
844 error gyp verb command configure []
844 error gyp verb check python checking for Python executable "python2" in the PATH
844 error gyp verb `which` succeeded python2 /usr/bin/python2
844 error gyp verb check python version `/usr/bin/python2 -c "import sys; print "2.7.18
844 error gyp verb check python version .%s.%s" % sys.version_info[:3];"` returned: %j
844 error gyp verb get node dir no --target version specified, falling back to host node version: 16.3.0
844 error gyp verb command install [ '16.3.0' ]
844 error gyp verb install input version string "16.3.0"
844 error gyp verb install installing version: 16.3.0
844 error gyp verb install --ensure was passed, so won't reinstall if already installed
844 error gyp verb install version is already installed, need to check "installVersion"
844 error gyp verb got "installVersion" 9
844 error gyp verb needs "installVersion" 9
844 error gyp verb install version is good
844 error gyp verb get node dir target node version installed: 16.3.0
844 error gyp verb build dir attempting to create "build" dir: /home/qwaz/dev/GitHub/beginner-gulp/node_modules/node-sass/build
844 error gyp verb build dir "build" dir needed to be created? /home/qwaz/dev/GitHub/beginner-gulp/node_modules/node-sass/build
844 error gyp verb build/config.gypi creating config file
844 error gyp verb build/config.gypi writing out config file: /home/qwaz/dev/GitHub/beginner-gulp/node_modules/node-sass/build/config.gypi
844 error (node:8585) [DEP0150] DeprecationWarning: Setting process.config is deprecated. In the future the property will be read-only.
844 error (Use `node --trace-deprecation ...` to show where the warning was created)
844 error gyp verb config.gypi checking for gypi file: /home/qwaz/dev/GitHub/beginner-gulp/node_modules/node-sass/config.gypi
844 error gyp verb common.gypi checking for gypi file: /home/qwaz/dev/GitHub/beginner-gulp/node_modules/node-sass/common.gypi
844 error gyp verb gyp gyp format was not specified; forcing "make"
844 error gyp info spawn /usr/bin/python2
844 error gyp info spawn args [
844 error gyp info spawn args   '/home/qwaz/dev/GitHub/beginner-gulp/node_modules/node-gyp/gyp/gyp_main.py',
844 error gyp info spawn args   'binding.gyp',
844 error gyp info spawn args   '-f',
844 error gyp info spawn args   'make',
844 error gyp info spawn args   '-I',
844 error gyp info spawn args   '/home/qwaz/dev/GitHub/beginner-gulp/node_modules/node-sass/build/config.gypi',
844 error gyp info spawn args   '-I',
844 error gyp info spawn args   '/home/qwaz/dev/GitHub/beginner-gulp/node_modules/node-gyp/addon.gypi',
844 error gyp info spawn args   '-I',
844 error gyp info spawn args   '/home/qwaz/.node-gyp/16.3.0/include/node/common.gypi',
844 error gyp info spawn args   '-Dlibrary=shared_library',
844 error gyp info spawn args   '-Dvisibility=default',
844 error gyp info spawn args   '-Dnode_root_dir=/home/qwaz/.node-gyp/16.3.0',
844 error gyp info spawn args   '-Dnode_gyp_dir=/home/qwaz/dev/GitHub/beginner-gulp/node_modules/node-gyp',
844 error gyp info spawn args   '-Dnode_lib_file=/home/qwaz/.node-gyp/16.3.0/<(target_arch)/node.lib',
844 error gyp info spawn args   '-Dmodule_root_dir=/home/qwaz/dev/GitHub/beginner-gulp/node_modules/node-sass',
844 error gyp info spawn args   '-Dnode_engine=v8',
844 error gyp info spawn args   '--depth=.',
844 error gyp info spawn args   '--no-parallel',
844 error gyp info spawn args   '--generator-output',
844 error gyp info spawn args   'build',
844 error gyp info spawn args   '-Goutput_dir=.'
844 error gyp info spawn args ]
844 error gyp verb command build []
844 error gyp verb build type Release
844 error gyp verb architecture x64
844 error gyp verb node dev dir /home/qwaz/.node-gyp/16.3.0
844 error gyp verb `which` succeeded for `make` /usr/bin/make
844 error gyp info spawn make
844 error gyp info spawn args [ 'V=1', 'BUILDTYPE=Release', '-C', 'build' ]
844 error ../src/libsass/src/cencode.c: In function ‘base64_encode_block’:
844 error ../src/libsass/src/cencode.c:48:11: warning: this statement may fall through [-Wimplicit-fallthrough=]
844 error    48 |    result = (fragment & 0x003) << 4;
844 error       |    ~~~~~~~^~~~~~~~~~~~~~~~~~~~~~~~~
844 error ../src/libsass/src/cencode.c:52:2: note: here
844 error    52 |  case step_B:
844 error       |  ^~~~
844 error ../src/libsass/src/cencode.c:62:11: warning: this statement may fall through [-Wimplicit-fallthrough=]
844 error    62 |    result = (fragment & 0x00f) << 2;
844 error       |    ~~~~~~~^~~~~~~~~~~~~~~~~~~~~~~~~
844 error ../src/libsass/src/cencode.c:66:2: note: here
844 error    66 |  case step_C:
844 error       |  ^~~~
844 error ../src/libsass/src/functions.cpp: In function ‘void Sass::Functions::handle_utf8_error(const Sass::ParserState&, Sass::Backtraces)’:
844 error ../src/libsass/src/functions.cpp:110:20: warning: catching polymorphic type ‘class utf8::invalid_code_point’ by value [-Wcatch-value=]
844 error   110 |       catch (utf8::invalid_code_point) {
844 error       |                    ^~~~~~~~~~~~~~~~~~
844 error ../src/libsass/src/functions.cpp:114:20: warning: catching polymorphic type ‘class utf8::not_enough_room’ by value [-Wcatch-value=]
844 error   114 |       catch (utf8::not_enough_room) {
844 error       |                    ^~~~~~~~~~~~~~~
844 error ../src/libsass/src/functions.cpp:118:20: warning: catching polymorphic type ‘class utf8::invalid_utf8’ by value [-Wcatch-value=]
844 error   118 |       catch (utf8::invalid_utf8) {
844 error       |                    ^~~~~~~~~~~~
844 error ../src/libsass/src/json.cpp: In function ‘char* json_encode_string(const char*)’:
844 error ../src/libsass/src/json.cpp:405:15: warning: catching polymorphic type ‘class std::exception’ by value [-Wcatch-value=]
844 error   405 |   catch (std::exception) {
844 error       |               ^~~~~~~~~
844 error ../src/libsass/src/json.cpp: In function ‘char* json_stringify(const JsonNode*, const char*)’:
844 error ../src/libsass/src/json.cpp:424:15: warning: catching polymorphic type ‘class std::exception’ by value [-Wcatch-value=]
844 error   424 |   catch (std::exception) {
844 error       |               ^~~~~~~~~
844 error In file included from /home/qwaz/.node-gyp/16.3.0/include/node/v8.h:30,
844 error                  from /home/qwaz/.node-gyp/16.3.0/include/node/node.h:63,
844 error                  from ../../nan/nan.h:56,
844 error                  from ../src/binding.cpp:1:
844 error /home/qwaz/.node-gyp/16.3.0/include/node/v8-internal.h: In function ‘void v8::internal::PerformCastCheck(T*)’:
844 error /home/qwaz/.node-gyp/16.3.0/include/node/v8-internal.h:452:38: error: ‘remove_cv_t’ is not a member of ‘std’; did you mean ‘remove_cv’?
844 error   452 |             !std::is_same<Data, std::remove_cv_t<T>>::value>::Perform(data);
844 error       |                                      ^~~~~~~~~~~
844 error       |                                      remove_cv
844 error /home/qwaz/.node-gyp/16.3.0/include/node/v8-internal.h:452:38: error: ‘remove_cv_t’ is not a member of ‘std’; did you mean ‘remove_cv’?
844 error   452 |             !std::is_same<Data, std::remove_cv_t<T>>::value>::Perform(data);
844 error       |                                      ^~~~~~~~~~~
844 error       |                                      remove_cv
844 error /home/qwaz/.node-gyp/16.3.0/include/node/v8-internal.h:452:50: error: template argument 2 is invalid
844 error   452 |             !std::is_same<Data, std::remove_cv_t<T>>::value>::Perform(data);
844 error       |                                                  ^
844 error /home/qwaz/.node-gyp/16.3.0/include/node/v8-internal.h:452:63: error: ‘::Perform’ has not been declared
844 error   452 |             !std::is_same<Data, std::remove_cv_t<T>>::value>::Perform(data);
844 error       |                                                               ^~~~~~~
844 error ../src/binding.cpp: In function ‘Nan::NAN_METHOD_RETURN_TYPE render(Nan::NAN_METHOD_ARGS_TYPE)’:
844 error ../src/binding.cpp:284:98: warning: cast between incompatible function types from ‘void (*)(uv_work_t*)’ {aka ‘void (*)(uv_work_s*)’} to ‘uv_after_work_cb’ {aka ‘void (*)(uv_work_s*, int)’} [-Wcast-function-type]
844 error   284 |     int status = uv_queue_work(uv_default_loop(), &ctx_w->request, compile_it, (uv_after_work_cb)MakeCallback);
844 error       |                                                                                                  ^~~~~~~~~~~~
844 error ../src/binding.cpp: In function ‘Nan::NAN_METHOD_RETURN_TYPE render_file(Nan::NAN_METHOD_ARGS_TYPE)’:
844 error ../src/binding.cpp:320:98: warning: cast between incompatible function types from ‘void (*)(uv_work_t*)’ {aka ‘void (*)(uv_work_s*)’} to ‘uv_after_work_cb’ {aka ‘void (*)(uv_work_s*, int)’} [-Wcast-function-type]
844 error   320 |     int status = uv_queue_work(uv_default_loop(), &ctx_w->request, compile_it, (uv_after_work_cb)MakeCallback);
844 error       |                                                                                                  ^~~~~~~~~~~~
844 error In file included from ../../nan/nan.h:56,
844 error                  from ../src/binding.cpp:1:
844 error ../src/binding.cpp: At global scope:
844 error /home/qwaz/.node-gyp/16.3.0/include/node/node.h:806:43: warning: cast between incompatible function types from ‘void (*)(Nan::ADDON_REGISTER_FUNCTION_ARGS_TYPE)’ {aka ‘void (*)(v8::Local<v8::Object>)’} to ‘node::addon_register_func’ {aka ‘void (*)(v8::Local<v8::Object>, v8::Local<v8::Value>, void*)’} [-Wcast-function-type]
844 error   806 |       (node::addon_register_func) (regfunc),                          \
844 error       |                                           ^
844 error /home/qwaz/.node-gyp/16.3.0/include/node/node.h:840:3: note: in expansion of macro ‘NODE_MODULE_X’
844 error   840 |   NODE_MODULE_X(modname, regfunc, NULL, 0)  // NOLINT (readability/null_usage)
844 error       |   ^~~~~~~~~~~~~
844 error ../src/binding.cpp:358:1: note: in expansion of macro ‘NODE_MODULE’
844 error   358 | NODE_MODULE(binding, RegisterModule);
844 error       | ^~~~~~~~~~~
844 error make: *** [binding.target.mk:133: Release/obj.target/binding/src/binding.o] Error 1
844 error gyp ERR! build error
844 error gyp ERR! stack Error: `make` failed with exit code: 2
844 error gyp ERR! stack     at ChildProcess.onExit (/home/qwaz/dev/GitHub/beginner-gulp/node_modules/node-gyp/lib/build.js:262:23)
844 error gyp ERR! stack     at ChildProcess.emit (node:events:394:28)
844 error gyp ERR! stack     at Process.ChildProcess._handle.onexit (node:internal/child_process:290:12)
844 error gyp ERR! System Linux 5.4.72-microsoft-standard-WSL2
844 error gyp ERR! command "/home/qwaz/.nvm/versions/node/v16.3.0/bin/node" "/home/qwaz/dev/GitHub/beginner-gulp/node_modules/node-gyp/bin/node-gyp.js" "rebuild" "--verbose" "--libsass_ext=" "--libsass_cflags=" "--libsass_ldflags=" "--libsass_library="
844 error gyp ERR! cwd /home/qwaz/dev/GitHub/beginner-gulp/node_modules/node-sass
844 error gyp ERR! node -v v16.3.0
844 error gyp ERR! node-gyp -v v3.8.0
844 error gyp ERR! not ok
844 error Build failed with error code: 1
845 verbose exit 1

В чем может быть причина? Возможно ли, что это связано с тем, что LibSass и сответсвенно Node Sass признали устаревшим?

Для себя нашел решение - вместо gulp-sass использовать gulp-dart-sass. Устанавливается без ошибок, а работает так же.

1 0

Nikita Mikhaylov

Здравствуйте

Странно, похоже просто на какую-то ошибку не связанную с самим пакетом. Попробовал у себя поставить (тоже есть на одном из компов связка WSL2 + Ubuntu) — всё прошло хорошо.

Если у вас нормально отработал dart-sass, то оставьте его. Он не помешает при разработке и действительно поддерживается сейчас

0

Используйте Хекслет по максимуму!

  • Задавайте вопросы по уроку
  • Проверяйте знания в квизах
  • Проходите практику прямо в браузере
  • Отслеживайте свой прогресс

Зарегистрируйтесь или войдите в свой аккаунт

Даю согласие на обработку персональных данных, соглашаюсь с «Политикой конфиденциальности» и «Условиями оказания услуг»

Рекомендуемые программы

С нуля до разработчика. Возвращаем деньги, если не удалось найти работу.

Иконка программы Фронтенд-разработчик
Профессия
Разработка фронтенд-компонентов веб-приложений
25 мая 10 месяцев
Иконка программы Python-разработчик
Профессия
Разработка веб-приложений на Django
25 мая 10 месяцев
Иконка программы PHP-разработчик
Профессия
Разработка веб-приложений на Laravel
25 мая 10 месяцев
Иконка программы Node.js-разработчик
Профессия
Разработка бэкенд-компонентов веб-приложений
25 мая 10 месяцев
Иконка программы Fullstack-разработчик
Профессия
Новый
Разработка фронтенд и бэкенд компонентов веб-приложений
25 мая 16 месяцев
Иконка программы Верстальщик
Профессия
Вёрстка с использованием последних стандартов CSS
в любое время 5 месяцев
Иконка программы Java-разработчик
Профессия
Разработка приложений на языке Java
25 мая 10 месяцев
Иконка программы Разработчик на Ruby on Rails
Профессия
Создает веб-приложения со скоростью света
25 мая 5 месяцев