Вопрос №58209 от пользователя Михаил Цуранов в испытании «Одинаковая чётность»

Михаил Цуранов

Добрый вечер! Ошибка совсем мне непонятная, относится к компиляции... (Ревью) make: Entering directory '/usr/src/app' mvn test -q -o [ERROR] COMPILATION ERROR : [ERROR] /usr/src/app/tests/SameParityFilterTest.java:[1,1] cannot find symbol symbol: static same_parity_filter location: class hexlet.SameParityFilter [ERROR] /usr/src/app/tests/SameParityFilterTest.java:[16,29] cannot find symbol symbol: method same_parity_filter(java.util.ArrayList<java.lang.Integer>) location: class SameParityFilterTest [ERROR] /usr/src/app/tests/SameParityFilterTest.java:[24,27] cannot find symbol symbol: method same_parity_filter(java.util.ArrayList<java.lang.Integer>) location: class SameParityFilterTest [ERROR] /usr/src/app/tests/SameParityFilterTest.java:[32,27] cannot find symbol symbol: method same_parity_filter(java.util.ArrayList<java.lang.Integer>) location: class SameParityFilterTest [ERROR] Failed to execute goal org.apache.maven.plugins:maven-compiler-plugin:3.8.1:testCompile (default-testCompile) on project JavaDataStructure: Compilation failure: Compilation failure: [ERROR] /usr/src/app/tests/SameParityFilterTest.java:[1,1] cannot find symbol [ERROR] symbol: static same_parity_filter [ERROR] location: class hexlet.SameParityFilter [ERROR] /usr/src/app/tests/SameParityFilterTest.java:[16,29] cannot find symbol [ERROR] symbol: method same_parity_filter(java.util.ArrayList<java.lang.Integer>) [ERROR] location: class SameParityFilterTest [ERROR] /usr/src/app/tests/SameParityFilterTest.java:[24,27] cannot find symbol [ERROR] symbol: method same_parity_filter(java.util.ArrayList<java.lang.Integer>) [ERROR] location: class SameParityFilterTest [ERROR] /usr/src/app/tests/SameParityFilterTest.java:[32,27] cannot find symbol [ERROR] symbol: method same_parity_filter(java.util.ArrayList<java.lang.Integer>) [ERROR] location: class SameParityFilterTest [ERROR] -> [Help 1] [ERROR] [ERROR] To see the full stack trace of the errors, re-run Maven with the -e switch. [ERROR] Re-run Maven using the -X switch to enable full debug logging. [ERROR] [ERROR] For more information about the errors and possible solutions, please read the following articles: [ERROR] [Help 1] http://cwiki.apache.org/confluence/display/MAVEN/MojoFailureException make: *** [Makefile:5: test] Error 1 make: Leaving directory '/usr/src/app'

2 0

Максим Литвинов

Михаил, добрый день! Сделайте методы статическими и всё заработает

1

Михаил Цуранов

Эх! Shame on my poor head... Спасибо! Всё прошло!

0

Используйте Хекслет по максимуму!

  • Задавайте вопросы по уроку
  • Проверяйте знания в квизах
  • Проходите практику прямо в браузере
  • Отслеживайте свой прогресс

Зарегистрируйтесь или войдите в свой аккаунт

Отправляя форму, вы соглашаетесь c «Политикой конфиденциальности» и «Условиями оказания услуг»

Рекомендуемые программы

С нуля до разработчика. Возвращаем деньги, если не удалось найти работу.

Иконка программы Фронтенд-разработчик
Профессия
Разработка фронтенд-компонентов веб-приложений
8 декабря 8 месяцев
Иконка программы Python-разработчик
Профессия
Разработка веб-приложений на Django
8 декабря 8 месяцев
Иконка программы PHP-разработчик
Профессия
Разработка веб-приложений на Laravel
8 декабря 8 месяцев
Иконка программы Node.js-разработчик
Профессия
Разработка бэкенд-компонентов веб-приложений
8 декабря 8 месяцев
Иконка программы Верстальщик
Профессия
Вёрстка с использованием последних стандартов CSS
в любое время 5 месяцев
Иконка программы Java-разработчик
Профессия
Разработка приложений на языке Java
8 декабря 10 месяцев
Иконка программы Разработчик на Ruby on Rails
Профессия
Новый
Создает веб-приложения со скоростью света
8 декабря 5 месяцев